R5_Caseid_pub,R5_C_Rtype,R5_C_Resptype,R5_c_IntAge_Pub,R5_ORGSAMPINFO_Hispanic,R5_ORGSAMPINFO_SEX,R5_ORGSAMPINFO_BSTATUS,R5_a_strata,R5_a_psu_pub,R5_WTR5_BEN,R5_B1,R5_B3,R5_B23_2,R5_B23_3,R5_b24_i,R5_B25_A,R5_B25_B,R5_B25_C,R5_B25_D,R5_B25_F,R5_B25_G,R5_B25_H,R5_B25_I,R5_B25_J,R5_B25_L,R5_B25_M,R5_B25_N,R5_B25_O,R5_B25_P,R5_B25_Q,R5_B26,R5_B28,R5_B28A,R5_B29_A,R5_B29_B,R5_B29_C,R5_B29_D,R5_B29_E,R5_B29_F,R5_B29_F1,R5_B29_G,R5_B29_H,R5_B29_1A,R5_B29_7_A,R5_B29_7_B,R5_B29_7_C,R5_B29_7_D,R5_B29_7_E,R5_B29_7_F,R5_B29_7_G,R5_B29_7_H,R5_B29_7_I,R5_B29_7_J,R5_B29_7_K,R5_B30,R5_B30_B,R5_B37,R5_B37A,R5_B38,R5_B39,R5_B40,R5_B41,R5_B42,R5_B43,R5_B44,R5_B45,R5_B46,R5_B47_A,R5_B47_B,R5_B47_C,R5_B47_D,R5_C_MAINCONCOLDIAGGRP_I_PUB,R5_c_adultchild_onset_i,R5_C_WrkdWhenLim,R5_C_EvrWorked,R5_C5A_1,R5_C7_1,R5_C10_1,R5_C18_1,R5_C20A_1,R5_C20B_1,R5_C20C_1,R5_C20D_1,R5_C20H_1,R5_C22,R5_C27,R5_C39_A,R5_C39_B,R5_C39_C,R5_C39_D,R5_C39_E,R5_C39_F,R5_C39_G,R5_C39_H,R5_C39_I,R5_C39_J,R5_C39_K,R5_C39_L,R5_C39_M,R5_C39A2,R5_C39B_A,R5_C39B_B,R5_C39B_C,R5_C39B_D,R5_C39B_E,R5_C39B_F,R5_C39b_g,R5_C39_1,R5_C39_3_A,R5_C39_3_B,R5_C39_3_C,R5_C39_3_D,R5_C39_3_E,R5_C39_3_F,R5_C39_3_G,R5_C39_3_H,R5_C39_4,R5_C39_4A,R5_C39_5,R5_C39_6,R5_C_MainCurJobSOC_PUB,R5_C_MainCurJobNAICS_PUB,R5_C_TotCurMnthPay_i_PUB,R5_C_MnthsMainCurJob_PUB,R5_C_MainCurJobRepSSA_PUB,R5_C_TotCurWkHrs_i_PUB,R5_C_TotCurHrMnth_i_PUB,R5_D1,R5_d6yr_m_PUB,R5_D8yr_m_PUB,R5_D15_m_PUB,R5_D16_m_PUB,R5_D17_m_PUB,R5_D18_m_PUB,R5_D25,R5_D25_A,R5_D25_B,R5_D25_C,R5_D25_D,R5_D25_E,R5_D25_F,R5_D25_g,R5_D25_1,R5_D26_A,R5_D26_B,R5_D26_C,R5_D26_D,R5_D26_E,R5_D26_F,R5_D26_G,R5_D26_H,R5_D26_i,R5_D26_j,R5_D27,R5_D28,R5_D29,R5_D30,R5_C_MainJob2014SOC_PUB,R5_C_MainJob2014NAICS_PUB,R5_C_MainJobMnthPay2014_PUB,R5_C_MnthsMain2014Job,R5_C_TOT2014PAY_PUB,R5_C_TotHrs2014_PUB,R5_C_UsWkHr2014_PUB,R5_E3,R5_E5,R5_E7,R5_E9,R5_E12,R5_E15,R5_E17,R5_E19,R5_E20_A,R5_E20_B,R5_E20_C,R5_E20_D,R5_E20_E,R5_E20_F,R5_E21,R5_G1,R5_G10,R5_G15,R5_G19,R5_G23,R5_G26,R5_G29,R5_G53_1,R5_G53_2,R5_G53_3,R5_G53_4,R5_G53_5,R5_G53_6,R5_G53_7,R5_G53_8,R5_G53_9,R5_G54,R5_G57,R5_G58,R5_G59,R5_G60,R5_G61_1,R5_G61_2,R5_G61_3,R5_G61_4,R5_G61_5,R5_G61_6,R5_G61_7,R5_C_EvrUseSVR,R5_C_EvrUseWel,R5_C_EvrUseSMenH,R5_C_EvrUseOStat,R5_C_EvrUsePriv,R5_C_EvrUseOth,R5_C_EvrUseSchool,R5_C_EvrUseUnemply,R5_C_EvrUseClinic,R5_C_EvrUseRehab,R5_C_EvrUseOthMed,R5_C_EmpProvUnkwn,R5_C_MedProvUnkwn,R5_C_EvrUsedServ,R5_C_EvrUseEmploy,R5_C_NUMPROV2014_pub,R5_C_NUMPROVEVUSED_pub,R5_C_UseSVR2014,R5_C_UseWEL2014,R5_C_UseSMenH2014,R5_C_UseOthSt2014,R5_C_UsePriv2014,R5_C_UseOthNonSt2014,R5_C_UseSchool2014,R5_C_UseUnemp2014,R5_C_UseClinic2014,R5_C_UseRehab2014,R5_C_UseOthMed2014,R5_C_EmpUnkwn2014,R5_C_MedUnkwn2014,R5_C_ServUse2014,R5_C_PhyTH2014,R5_C_OccTher2014,R5_C_SpchTher2014,R5_C_MedProc2014,R5_C_Equip2014,R5_C_Coun2014,R5_C_GrpTh2014,R5_C_WrkAs2014,R5_C_FindJob2014,R5_C_JobTrn2014,R5_C_JobMod2014,R5_C_JobCch2014,R5_C_OtherServ2014,R5_C_PROVTYPE2014_01_1,R5_C_PROVTYPE2014_03_1,R5_C_PROVTYPE2014_04_1,R5_C_PROVTYPE2014_05_1,R5_C_PROVTYPE2014_07_1,R5_C_PROVTYPE2014_10_1,R5_C_PROVTYPE2014_10_2,R5_C_PROVTYPE2014_10_3,R5_C_PROVTYPE2014_11_1,R5_C_PROVTYPE2014_12_1,R5_C_PHYTH2014_01_1,R5_C_OCCTH2014_01_1,R5_C_SPCHTH2014_01_1,R5_C_MED2014_01_1,R5_C_EQUIP2014_01_1,R5_C_COUN2014_01_1,R5_C_GRPTH2014_01_1,R5_C_WRKAS2014_01_1,R5_C_FNDJOB2014_01_1,R5_C_JOBTRN2014_01_1,R5_C_JOBMD2014_01_1,R5_C_JOBCCH2014_01_1,R5_C_OTHR2014_01_1,R5_C_PHYTH2014_03_1,R5_C_OCCTH2014_03_1,R5_C_SPCHTH2014_03_1,R5_C_MED2014_03_1,R5_C_EQUIP2014_03_1,R5_C_COUN2014_03_1,R5_C_GRPTH2014_03_1,R5_C_WRKAS2014_03_1,R5_C_FNDJOB2014_03_1,R5_C_JOBTRN2014_03_1,R5_C_JOBMD2014_03_1,R5_C_JOBCCH2014_03_1,R5_C_OTHR2014_03_1,R5_C_PHYTH2014_04_1,R5_C_OCCTH2014_04_1,R5_C_SPCHTH2014_04_1,R5_C_MED2014_04_1,R5_C_EQUIP2014_04_1,R5_C_COUN2014_04_1,R5_C_GRPTH2014_04_1,R5_C_WRKAS2014_04_1,R5_C_FNDJOB2014_04_1,R5_C_JOBTRN2014_04_1,R5_C_JOBMD2014_04_1,R5_C_JOBCCH2014_04_1,R5_C_OTHR2014_04_1,R5_C_PHYTH2014_05_1,R5_C_OCCTH2014_05_1,R5_C_SPCHTH2014_05_1,R5_C_MED2014_05_1,R5_C_EQUIP2014_05_1,R5_C_COUN2014_05_1,R5_C_GRPTH2014_05_1,R5_C_WRKAS2014_05_1,R5_C_FNDJOB2014_05_1,R5_C_JOBTRN2014_05_1,R5_C_JOBMD2014_05_1,R5_C_JOBCCH2014_05_1,R5_C_OTHR2014_05_1,R5_C_PHYTH2014_07_1,R5_C_OCCTH2014_07_1,R5_C_SPCHTH2014_07_1,R5_C_MED2014_07_1,R5_C_EQUIP2014_07_1,R5_C_COUN2014_07_1,R5_C_GRPTH2014_07_1,R5_C_WRKAS2014_07_1,R5_C_FNDJOB2014_07_1,R5_C_JOBTRN2014_07_1,R5_C_JOBMD2014_07_1,R5_C_JOBCCH2014_07_1,R5_C_OTHR2014_07_1,R5_C_PHYTH2014_10_1,R5_C_OCCTH2014_10_1,R5_C_SPCHTH2014_10_1,R5_C_MED2014_10_1,R5_C_EQUIP2014_10_1,R5_C_COUN2014_10_1,R5_C_GRPTH2014_10_1,R5_C_WRKAS2014_10_1,R5_C_FNDJOB2014_10_1,R5_C_JOBTRN2014_10_1,R5_C_JOBMD2014_10_1,R5_C_JOBCCH2014_10_1,R5_C_OTHR2014_10_1,R5_C_PHYTH2014_10_2,R5_C_OCCTH2014_10_2,R5_C_SPCHTH2014_10_2,R5_C_MED2014_10_2,R5_C_EQUIP2014_10_2,R5_C_COUN2014_10_2,R5_C_GRPTH2014_10_2,R5_C_WRKAS2014_10_2,R5_C_FNDJOB2014_10_2,R5_C_JOBTRN2014_10_2,R5_C_JOBMD2014_10_2,R5_C_JOBCCH2014_10_2,R5_C_OTHR2014_10_2,R5_C_PHYTH2014_10_3,R5_C_OCCTH2014_10_3,R5_C_SPCHTH2014_10_3,R5_C_MED2014_10_3,R5_C_EQUIP2014_10_3,R5_C_COUN2014_10_3,R5_C_GRPTH2014_10_3,R5_C_WRKAS2014_10_3,R5_C_FNDJOB2014_10_3,R5_C_JOBTRN2014_10_3,R5_C_JOBMD2014_10_3,R5_C_JOBCCH2014_10_3,R5_C_OTHR2014_10_3,R5_C_PHYTH2014_11_1,R5_C_OCCTH2014_11_1,R5_C_SPCHTH2014_11_1,R5_C_MED2014_11_1,R5_C_EQUIP2014_11_1,R5_C_COUN2014_11_1,R5_C_GRPTH2014_11_1,R5_C_WRKAS2014_11_1,R5_C_FNDJOB2014_11_1,R5_C_JOBTRN2014_11_1,R5_C_JOBMD2014_11_1,R5_C_JOBCCH2014_11_1,R5_C_OTHR2014_11_1,R5_C_PHYTH2014_12_1,R5_C_OCCTH2014_12_1,R5_C_SPCHTH2014_12_1,R5_C_MED2014_12_1,R5_C_EQUIP2014_12_1,R5_C_COUN2014_12_1,R5_C_GRPTH2014_12_1,R5_C_WRKAS2014_12_1,R5_C_FNDJOB2014_12_1,R5_C_JOBTRN2014_12_1,R5_C_JOBMD2014_12_1,R5_C_JOBCCH2014_12_1,R5_C_OTHR2014_12_1,R5_C_PROVUSE2014_01_1,R5_C_NUMPROVCONT_03_1_PUB,R5_C_PROVUSE2014_03_1,R5_C_DURPROVVISIT_03_1_PUB,R5_C_PROVUSE2014_04_1,R5_C_PROVUSE2014_05_1,R5_C_PROVUSE2014_07_1,R5_C_NUMPROVCONT_10_1_PUB,R5_C_PROVUSE2014_10_1,R5_C_DURPROVVISIT_10_1_PUB,R5_C_NUMPROVCONT_10_2_PUB,R5_C_PROVUSE2014_10_2,R5_C_DURPROVVISIT_10_2_PUB,R5_C_PROVUSE2014_10_3,R5_C_PROVUSE2014_11_1,R5_C_NUMPROVCONT_12_1_PUB,R5_C_PROVUSE2014_12_1,R5_C_DURPROVVISIT_12_1_PUB,R5_I1_I,R5_I2,R5_I3,R5_I4,R5_I5,R5_I6,R5_I7,R5_I8,R5_I9_I,R5_I10,R5_I11,R5_I12,R5_I17b_I,R5_I19_I,R5_I21_I,R5_I22_I,R5_I23_I,R5_I25_I,R5_I26_I,R5_I27_I,R5_I29_I,R5_I30_I,R5_I31_I,R5_I32_1,R5_I32_2,R5_I34_I,R5_I35_I,R5_I36_I,R5_I37_I,R5_I38_I,R5_I39_I,R5_I40_I,R5_I41_I,R5_I42_I,R5_I43_I,R5_I44_I,R5_I45_i,R5_i46_i,R5_I47_i,R5_i48_i,R5_I49_i,R5_i50_i,R5_I51_i,R5_i52_i,R5_I53_i,R5_i54_i,R5_I55_i,R5_i56_i,R5_I57_i,R5_i58_i,R5_I59_I,R5_I60_I,R5_I61_I,R5_C_EquipFuncLim_I,R5_C_PCS8TOT_I,R5_C_MCS8TOT_I,R5_CageScore_indicator_i,R5_J8,R5_J10,R5_J11_1,R5_J11_2,R5_J11_7,R5_J11_8,R5_J11_9,R5_J11_10_PUB,R5_C_CurMedicare,R5_C_CurMedicaid,R5_C_CurMilInsur,R5_C_CurPrivEmp,R5_C_CurPrivSp,R5_C_CurPrivSelf,R5_C_CurOtherInsur,R5_C_CurNoInsur,R5_IncSource1_PUB,R5_IncSource2_PUB,R5_IncSource3_PUB,R5_IncSource4_PUB,R5_IncSource5_PUB,R5_IncSource6_PUB,R5_IncSource7_PUB,R5_C_LSTMNTHPAY_PUB,R5_C_TotGovCashBen_PUB,R5_C_TotNonCashBen_PUB,R5_L1_I,R5_L3_i_PUB,R5_L4_PUB,R5_L5_PUB,R5_L8_I_PUB,R5_L11_I_PUB,R5_L12_PUB,R5_L15,R5_c_cohab_i,R5_C_race_I_PUB,R5_c_bmi_cat_i,R5_C_HHSize_PUB,R5_C_NumChildHH_PUB,R5_C_NumOwnChildHH_PUB,R5_C_NumNonOwnChildHH_PUB,R5_C_NumOwnChildOHH_PUB,R5_C_NumOwnChild_PUB,R5_C_NumAdultHH_PUB,R5_C_FEDPOVERTYLEVEL_CAT1,R5_C_HHINC2014_PUB,R5_N_TotSSbenLastMnth_PUB,R5_N_BENSTATATINT2,R5_N_DEPENLASTMNTH_PUB,R5_N_STW_AtInt,R5_N_MTHSEARLENT_PUB,R5_N_MTHSRECENT_PUB,R5_N_PIAATINT_PUB,R5_N_SSDILastMnth_PUB,R5_N_SSDINOMCR_ATINT,R5_N_SSILastMnth_PUB,R5_N_TTWPARTEVER,R5_N_STW_EVER,R5_N_DAC,R5_N_RepPayee,R5_N_IMP_PSYCH,R5_N_IMP_MUSC,R5_N_IMP_CIRC,R5_N_IMP_ENDO,R5_N_IMP_ID,R5_N_IMP_NEO,R5_N_IMP_NERV,R5_N_IMP_RESP,R5_N_IMP_SENS,R5_N_IMP_INJ,R5_N_IMP_OTHER,R5_N_IMP_MISSING
80000263,1,1,3,0,2,3,1000,85079515,2001.8363891,1,1,1,,0,1,1,0,0,0,0,1,0,1,0,1,0,0,0,0,0,0,,,,,,,,,,,,,,,,,,,,,,,0,1,1,1,1,7,1,1,3,2,1,6,1,2,D,1,1,1,2,1,1,,,,,,,,,,,,,,,,,,,,,,,,,,,,,,,,,,,,,,,,,,,,,,,,,,,,,,,,,,,,,,,,,,,,,,,,,,,,,,,,,,,,,,,,,,0,0,0,0,,1,0,0,0,,1,0,0,,0,0,0,1,1,1,1,,0,0,3,4,0,0,0,0,0,0,,1,2,0,,,,,,,,0,0,1,0,0,0,1,0,1,0,0,0,0,1,0,4,5,0,0,1,0,0,0,0,0,1,0,0,0,0,1,1,1,,1,1,1,1,1,1,1,1,1,,,3,,,,10,10,10,,,,,,,,,,,,,,,,0,0,0,0,0,1,0,1,0,0,1,1,0,,,,,,,,,,,,,,,,,,,,,,,,,,,,,,,,,,,,,,,,0,0,0,1,1,1,0,0,0,0,1,0,0,1,1,0,1,0,1,0,0,0,0,1,0,0,0,1,0,0,0,1,1,1,1,1,1,1,0,,,,,,,,,,,,,,,,,,,,,,,,,,,,52.2,1,3,,,,18,2,0.25,52,2,1,1,,,,,4,4,4,5,3,4,5,4,2,1,1,1,0,,0,,,0,,,1,1,1,1,0,0,1,1,1,1,0,,1,1,1,0,0,,1,1,1,0,1,0,1,0,0,,0,,1,1,0,1,32.04161,24.22325,0,,1,1,2,0,0,0,0,1,1,0,0,0,0,0,0,0,0,0,1,1,1,1,0,750,230,2,1,D,D,2,6,1,,0,5,4,1,0,0,0,0,0,1,2,8000,750,3,0,0,142,141,740,740,0,20,0,0,0,1,1,0,0,0,0,0,0,0,0,0,0,0
80002607,2,3,1,0,1,2,1000,85081537,1110.5908894,1,1,2,D,0,1,1,0,0,0,D,1,0,0,1,1,0,0,1,1,0,0,,,,,,,,,,,,,,,,,,,,,,,0,0,1,0,1,4,3,D,,,,,,4,,4,,0,1,0,0,,,,,,,,,,,,,,,,,,,,,,,,,,,,,,,,,,,,,,,,,,,,,,,,,,,,,,,,,,,,,,,,,,,,,,,,,,,,,,,,,,,,,,,,,,,,,,,0,0,0,0,,D,,D,,0,1,0,0,0,0,,,0,0,3,4,0,0,0,0,0,0,,1,4,0,,,,,,,,0,0,0,0,D,D,D,D,0,0,0,1,0,1,1,1,1,0,0,0,0,D,D,D,D,0,0,0,1,0,1,,,,,,1,D,,1,D,,1,,,,,,,,,,,,,,,,,,,,,,,,,,,,,,,,,,,,,,,,,,,,,,,,,,,,,,,,,,,,,,,,,,,,,,,,,,,,,,,,,,,,,,,,,,,,,,,,,,,,,,,,,,,,,,,,,,,,,,,,,,,,,,,,,,,,,,,,,,,,,,,,,,,,,,,,,,,,,,,,3,5,5,4,4,2,1,1,3,1,0,0,0,,0,,,1,1,0,1,0,1,1,2,0,1,0,1,1,1,0,1,0,1,0,0,,1,1,1,1,1,1,1,1,1,1,1,1,1,1,0,1,21.00161,62.97325,0,,1,1,0,0,0,0,0,0,1,0,0,0,0,0,0,0,0,0,0,0,0,1,0,1800,0,2,2,4,4,2,6,13,1,0,5,1,1,0,0,0,0,0,1,4,19200,1800,2,0,0,137,39,2527,1800,0,0,0,0,1,0,0,0,0,0,0,0,1,0,0,0,0,0
80003070,2,3,1,0,2,1,1000,85066369,880.46796204,1,0,2,0,0,1,1,0,0,0,0,1,0,0,0,0,0,0,0,0,0,0,,,,,,,,,,,,,,,,,,,,,,,0,0,0,0,0,,,,,,,,,3,,3,,2,1,0,0,,,,,,,,,,,,,,,,,,,,,,,,,,,,,,,,,,,,,,,,,,,,,,,,,,,,,,,,,,,,,,,,,,,,,,,,,,,,,,,,,,,,,,,,,,0,0,0,0,0,,,0,0,,0,,0,,0,0,0,0,0,0,,,,,,,,,,,,,,0,,0,,,,,,,,0,0,0,0,0,0,0,0,0,0,0,0,0,0,0,0,0,0,0,0,0,0,0,0,0,0,0,0,0,0,0,,,,,,,,,,,,,,,,,,,,,,,,,,,,,,,,,,,,,,,,,,,,,,,,,,,,,,,,,,,,,,,,,,,,,,,,,,,,,,,,,,,,,,,,,,,,,,,,,,,,,,,,,,,,,,,,,,,,,,,,,,,,,,,,,,,,,,,,,,,,,,,,,,,,,,,,,,,,,,,,,,,,,,,,,,,,3,1,1,1,3,1,4,3,3,1,0,0,0,,0,,,1,1,0,0,,,,,,0,,0,,0,,0,,0,,0,,1,0,0,,1,1,1,1,0,,0,,1,1,1,0,61.17161,31.03325,0,,1,1,2,0,0,9,0,1,1,0,0,0,1,0,0,0,0,0,0,0,0,1,0,630,0,1,2,D,2,2,2,1,,0,5,3,4,1,0,1,0,0,2,3,,630,1,0,0,38,39,0,0,0,630,0,0,0,1,0,0,0,0,1,0,0,0,0,0,0,0
80001073,2,3,2,0,2,2,1000,85073203,893.66048032,1,1,2,1,0,1,1,0,0,0,0,0,0,0,1,0,0,0,0,0,0,0,,,,,,,,,,,,,,,,,,,,,,,0,0,0,0,0,,,,,,,,,4,,4,,0,1,0,0,,,,,,,,,,,,,,,,,,,,,,,,,,,,,,,,,,,,,,,,,,,,,,,,,,,,,,,,,,,,,,,,,,,,,,,,,,,,,,,,,,,,,,,,,,,,,,,1,1,1,1,0,1,0,1,0,1,1,0,1,0,0,,,0,0,3,0,0,0,0,0,0,0,,0,,0,,,,,,,,0,0,0,1,0,0,0,0,0,1,0,0,0,1,1,1,2,0,0,0,0,0,0,0,0,0,1,0,0,0,1,,,,,1,,,,,,,,,,,,,,,,,11,,,,,,,,,,,,,,,,,,,,,,,,,,,,,,,,,,,,,,,,,,,,,,,,,,,,,,,,,,,,,,,,,,,,,,,,,,,,,,,,,,,,,,,,,,,,,,,,,,,,,,,,,,0,0,0,0,1,0,0,0,0,0,0,0,0,,,,,,,,,,,,,,,,,,,,,,,,,,,,1,,,,4,5,5,6,5,3,1,1,4,0,0,0,0,,0,,,0,,,1,0,1,0,2,0,1,0,1,0,1,0,1,0,1,0,1,1,1,1,1,1,1,1,1,1,1,1,0,,1,0,0,1,13.52161,59.14325,0,,1,0,2,0,0,0,10,1,0,0,0,0,0,0,0,0,0,0,0,0,0,1,0,1700,0,2,2,2,2,2,2,1,,0,5,3,2,0,0,0,0,0,2,4,30000,1700,2,0,0,179,180,2300,1700,0,0,0,0,1,1,0,0,0,0,1,0,1,0,0,0,0,0
80003779,1,1,2,0,2,2,1000,85074281,1227.8969806,1,1,2,0,1,,,,,,,,,,,,,,,,,,,,,,,,,,,,,,,,,,,,,,,,0,,0,1,1,1,3,0,,,,,,2,2,2,2,0,1,0,1,0,0,0,1,,,,,,0,0,1,5,3,,2,2,1,1,1,1,,1,2,D,,,,,,,,0,0,0,0,0,0,0,0,0,0,,0,,99,99,400,3,,10,44,,,,,,,,,,,,,,,,,,,,,,,,,,,,,,,,,,,,,,,,,,,0,0,0,0,,0,,0,,0,0,1,1,1,0,0,,0,0,3,0,0,0,0,0,0,0,,0,,0,,,,,,,,0,0,0,0,0,1,1,0,1,0,1,0,0,1,1,3,6,0,0,0,0,0,0,0,0,1,0,0,0,0,1,,,,1,1,1,,,,,,,,,,,,,10,10,10,,,,,,,,,,,,,,,,,,,,,,,,,,,,,,,,,,,,,,,,,,,,,,,,,,,,,,,,,,,,,,,,,,,,0,0,0,1,0,0,0,0,0,0,0,0,0,0,0,0,1,1,0,0,0,0,0,0,0,0,0,0,0,0,0,1,0,0,0,0,0,0,0,,,,,,,,,,,,,,,,,,,,,,,,,,,,,,,,,,2,1,8,10,1,D,1,,,,,2,3,4,4,3,3,2,3,1,0,1,0,0,,0,,,0,,,1,1,1,1,0,1,0,,0,,0,,1,1,1,1,0,,0,,0,,1,1,0,,0,,0,,1,1,0,1,33.04161,48.58325,0,,1,1,2,0,0,0,0,1,1,0,0,0,0,0,0,0,0,0,1,1,0,1,500,940,120,2,4,2,1,2,2,1,,0,5,2,2,1,1,0,0,1,1,2,10000,940,2,0,0,69,69,940,940,0,0,0,0,0,0,0,1,0,0,0,0,0,0,0,0,0,0
80002248,1,1,3,0,2,3,1000,85130080,11708.62366,1,0,3,0,0,,,,,,,,,,,,,,,,,1,2,0,0,1,0,0,0,0,1,0,0,0,0,0,1,0,0,0,1,1,1,0,0,0,0,1,0,,,,,,,,,1,1,2,2,0,2,0,1,,,,,,,,,,,,,,,,,,,,,,,,,,,,,,,,,,,,,,,,,,,,,,,,,,,,,,,,,,,,,,,,,,,,,,,,,,,,,,,,,,,,,,,,,,0,0,0,0,,0,0,0,0,,0,,0,,1,1,0,0,0,0,,,,,,,,,,,,,,0,,0,,,,,,,,0,0,0,0,1,0,0,0,0,0,0,0,0,1,1,0,2,0,0,0,0,0,0,0,0,0,0,0,0,0,0,,,,,,,,,,,,,,,,,,,,,,,,,,,,,,,,,,,,,,,,,,,,,,,,,,,,,,,,,,,,,,,,,,,,,,,,,,,,,,,,,,,,,,,,,,,,,,,,,,,,,,,,,,,,,,,,,,,,,,,,,,,,,,,,,,,,,,,,,,,,,,,,,,,,,,,,,,,,,,,,,,,,,,,,,,,,3,3,3,3,3,2,4,3,3,1,0,0,0,,0,,,0,,,1,1,0,,,1,0,,1,1,0,,0,,0,,0,,0,,0,,0,,0,,1,1,0,,1,0,1,0,44.83161,35.41325,0,,1,1,0,0,0,0,0,1,1,0,0,0,0,0,0,0,0,0,0,1,0,1,0,750,70,2,1,D,D,2,6,1,,0,7,4,1,0,0,0,0,0,1,2,9000,750,3,0,0,298,298,580,430,0,320,0,0,1,1,0,0,0,0,1,0,0,0,0,0,0,0
80000321,1,1,3,0,2,3,1000,85114142,2164.6414454,1,1,3,1,0,1,0,0,0,0,0,1,0,0,0,0,0,0,0,0,0,0,,,,,,,,,,,,,,,,,,,,,,,0,1,0,0,1,6,4,0,,,,,,3,,3,,3,2,1,1,,,,,,,,,,,,,,,,,,,,,,,,,,,,,,,,,,,,,,,,,,,,,,,,,,,,,,,,,,,,,,,,,,,,,,,,,,,,,,,,,,,,,,,,,,0,0,0,0,,0,0,0,1,1,1,0,0,,1,0,0,0,1,0,,,0,0,3,0,0,0,0,0,0,0,,0,,1,1,0,0,0,0,0,0,0,0,0,0,0,0,0,0,1,0,0,0,0,1,0,1,1,0,0,0,0,0,0,0,0,1,0,0,0,0,1,,,,1,,1,1,1,1,,,,,,,,,,10,,,,,,,,,,,,,,,,,,,,,,,,,,,,,,,,,,,,,,,,,,,,,,,,,,,,,,,,,,,,,,,,,,,,,,0,0,0,1,0,1,1,1,1,0,0,0,0,,,,,,,,,,,,,,,,,,,,,,,,,,,,,,,,,,,,,,,,,,,,,,,,,,,,,,,,,,,,36,1,0.5,,,,,,,,,3,4,4,6,5,3,4,3,4,1,1,1,0,,0,,,1,1,0,1,0,1,1,2,1,1,0,1,1,1,1,1,1,1,0,1,1,0,,1,1,0,,0,,1,1,1,0,1,0,0,1,27.31161,33.31325,0,,1,1,2,0,0,0,0,1,1,0,0,0,0,0,0,0,0,0,0,1,0,1,0,750,180,2,3,2,1,2,2,1,,1,5,4,3,0,0,0,0,0,2,4,30000,750,3,0,0,229,45,410,410,0,340,0,0,0,0,0,1,0,1,0,0,0,0,0,0,0,0
80000458,1,1,2,0,1,1,1000,85079505,1637.2392979,1,0,2,1,0,1,0,0,0,0,0,0,0,0,0,0,0,0,1,1,0,0,,,,,,,,,,,,,,,,,,,,,,,0,0,1,1,1,3,2,0,,,,,,2,3,1,2,0,2,1,1,,,,,,,,,,,,,,,,,,,,,,,,,,,,,,,,,,,,,,,,,,,,,,,,,,,,,,,,,,,,,,,,,,,,,,,,,,,,,,,,,,,,,,,,,,0,0,0,0,,,,0,0,,0,,0,,0,0,0,0,0,0,,,,,,,,,,,,,,1,3,1,0,0,0,0,0,0,7,0,0,0,0,0,0,0,0,0,0,0,0,0,0,0,0,0,0,0,0,0,0,0,0,0,0,0,0,0,0,0,,,,,,,,,,,,,,,,,,,,,,,,,,,,,,,,,,,,,,,,,,,,,,,,,,,,,,,,,,,,,,,,,,,,,,,,,,,,,,,,,,,,,,,,,,,,,,,,,,,,,,,,,,,,,,,,,,,,,,,,,,,,,,,,,,,,,,,,,,,,,,,,,,,,,,,,,,,,,,,,,,,,,,,,,,,,6,3,4,4,5,2,2,3,3,1,0,0,0,,0,,,0,,,1,0,1,0,2,0,1,0,1,0,1,0,1,0,1,0,1,0,0,,1,1,1,1,0,,0,,0,,0,1,1,1,25.39161,45.05325,0,,1,1,0,0,0,0,0,0,1,0,0,0,0,0,0,0,0,0,0,1,0,1,0,730,200,2,2,D,D,2,2,1,,1,7,4,2,0,0,0,2,2,2,2,9600,730,1,0,0,83,87,0,0,0,730,0,0,0,1,0,0,0,0,0,0,0,0,0,1,0,0
80003338,1,1,2,0,1,2,1000,85066420,1936.7342283,0,,1,,0,1,0,0,0,0,0,0,0,0,0,0,0,0,0,0,0,0,,,,,,,,,,,,,,,,,,,,,,,0,1,1,0,1,1,3,0,,,,,,4,,4,,,2,1,1,,,,,,,,,,,,,,,,,,,,,,,,,,,,,,,,,,,,,,,,,,,,,,,,,,,,,,,,,,,,,,,,,,,,,,,,,,,,,,,,,,,,,,,,,,,,,,,0,0,0,0,,1,0,0,,0,0,0,0,0,0,,,,,,,,,,,,,,0,,0,,,,,,,,0,0,0,0,0,0,0,0,0,0,0,0,0,0,0,0,0,0,0,0,0,0,0,0,0,0,0,0,0,0,0,,,,,,,,,,,,,,,,,,,,,,,,,,,,,,,,,,,,,,,,,,,,,,,,,,,,,,,,,,,,,,,,,,,,,,,,,,,,,,,,,,,,,,,,,,,,,,,,,,,,,,,,,,,,,,,,,,,,,,,,,,,,,,,,,,,,,,,,,,,,,,,,,,,,,,,,,,,,,,,,,,,,,,,,,,,,2,1,5,4,4,1,2,4,2,0,1,0,0,,0,,,0,,,0,,,,,,1,1,0,,0,,0,,1,1,0,,0,,0,,0,,0,,0,,0,,0,0,0,0,33.60161,44.21325,0,,0,,,,,,,1,1,0,0,0,0,0,0,0,0,0,0,1,0,1,0,1100,190,2,1,2,3,2,6,1,,0,7,2,1,0,0,0,0,0,1,3,,1100,2,0,0,295,145,1400,1100,0,0,0,0,1,1,1,0,0,0,0,0,0,0,0,0,0,0
80001897,1,1,4,0,1,2,1000,85095963,12890.64722,1,1,3,1,0,1,0,0,0,0,0,0,0,0,0,0,0,0,0,0,0,0,,,,,,,,,,,,,,,,,,,,,,,0,0,0,0,0,,,,,,,,,3,,3,,0,2,1,1,,,,,,,,,,,,,,,,,,,,,,,,,,,,,,,,,,,,,,,,,,,,,,,,,,,,,,,,,,,,,,,,,,,,,,,,,,,,,,,,,,,,,,,,,,,,,,,1,1,0,0,,0,,0,,0,0,0,0,0,0,,,,,,,,,,,,,,0,,0,,,,,,,,0,0,0,0,0,0,0,0,0,0,0,0,0,0,0,0,0,0,0,0,0,0,0,0,0,0,0,0,0,0,0,,,,,,,,,,,,,,,,,,,,,,,,,,,,,,,,,,,,,,,,,,,,,,,,,,,,,,,,,,,,,,,,,,,,,,,,,,,,,,,,,,,,,,,,,,,,,,,,,,,,,,,,,,,,,,,,,,,,,,,,,,,,,,,,,,,,,,,,,,,,,,,,,,,,,,,,,,,,,,,,,,,,,,,,,,,,4,4,3,4,3,2,2,1,3,1,0,0,0,,0,,,0,,,1,1,1,1,0,1,1,1,0,,0,,1,1,0,,0,,0,,0,,0,,0,,0,,0,,1,0,0,1,32.92161,55.54325,0,,1,0,2,0,0,0,0,1,0,0,0,0,1,0,0,0,0,1,0,0,0,1,0,1700,230,2,4,4,3,1,2,1,,1,5,3,2,0,0,0,0,0,2,8,70000,1700,2,0,0,254,,1700,1700,0,0,0,0,0,0,0,0,0,0,0,0,0,0,0,0,1,0
80003888,1,1,2,0,2,2,1000,85066373,1456.8432766,1,1,1,,0,1,0,0,1,0,0,1,0,1,1,0,0,0,0,0,0,0,,,,,,,,,,,,,,,,,,,,,,,0,0,0,1,1,2,3,1,1,3,1,8,3,3,,3,,0,2,1,1,,,,,,,,,,,,,,,,,,,,,,,,,,,,,,,,,,,,,,,,,,,,,,,,,,,,,,,,,,,,,,,,,,,,,,,,,,,,,,,,,,,,,,,,,,,,,,,0,0,0,0,,0,,0,,0,0,0,1,0,0,,,,,,,,,,,,,,0,,1,0,0,3,0,0,0,0,0,0,0,0,0,0,0,0,1,0,0,0,0,1,0,0,1,0,0,0,0,0,0,0,0,0,0,0,0,0,0,,,,,,,,,,,,,,,,,,,,,,,,,,,,,,,,,,,,,,,,,,,,,,,,,,,,,,,,,,,,,,,,,,,,,,,,,,,,,,,,,,,,,,,,,,,,,,,,,,,,,,,,,,,,,,,,,,,,,,,,,,,,,,,,,,,,,,,,,,,,,,,,,,,,,,,,,,,,,,,,,,,,,,,,,,,,5,5,5,6,5,5,5,4,5,1,1,1,1,0,0,,,1,1,0,1,1,1,1,2,0,1,0,1,0,0,,1,1,1,0,1,1,1,1,1,0,1,0,1,1,1,1,1,0,1,1,0,1,21.67161,21.09325,0,,1,0,0,0,8,0,0,0,0,0,0,0,1,0,0,0,0,0,0,1,0,1,0,1400,230,1,3,1,1,1,2,1,,0,5,4,4,1,1,0,0,3,1,1,10200,1400,2,410,0,13,13,1000,1000,1,0,0,0,0,0,0,0,0,0,0,0,0,1,0,0,0,0
80001160,1,1,3,0,2,2,1000,85100446,2533.790943,1,1,3,0,0,1,1,0,0,1,1,0,0,0,1,0,0,0,0,0,0,0,,,,,,,,,,,,,,,,,,,,,,,0,0,1,1,1,8,3,0,,,,,,D,,D,,1,2,1,1,,,,,,,,,,,,,,,,,,,,,,,,,,,,,,,,,,,,,,,,,,,,,,,,,,,,,,,,,,,,,,,,,,,,,,,,,,,,,,,,,,,,,,,,,,,,,,,0,0,1,0,,D,,0,,1,1,1,0,1,0,0,,,,,,,,,,,,,0,,0,,,,,,,,D,D,1,D,0,0,0,0,0,0,0,1,0,1,1,0,1,D,D,0,D,0,0,0,0,0,0,0,0,0,0,,,,,,,,,,,,,,,,,,,,,,,,,,,,,,,,,,,,,,,,,,,,,,,,,,,,,,,,,,,,,,,,,,,,,,,,,,,,,,,,,,,,,,,,,,,,,,,,,,,,,,,,,,,,,,,,,,,,,,,,,,,,,,,,,,,,,,,,,,,,,,,,,,,,,,,,,,,,,,,,,,,,,,,,,,,,5,4,4,5,4,4,5,4,3,1,1,1,0,,0,,,0,,,1,1,0,,,1,1,1,1,1,1,1,1,1,1,1,1,0,1,1,1,0,0,,0,,0,,0,,1,1,1,0,29.91161,21.61325,0,,1,0,2,0,0,0,0,1,0,0,0,0,0,0,0,0,0,0,0,0,0,1,0,1200,0,2,4,2,2,2,6,1,,0,5,2,1,0,0,0,0,0,1,3,,1200,2,0,0,161,161,1200,1200,0,0,1,0,0,0,1,0,0,0,0,0,0,0,0,0,0,0
80000048,2,3,1,0,2,1,1000,85079518,1025.8590424,1,1,1,,0,1,D,0,0,0,0,0,0,0,0,0,0,0,0,1,1,0,,,,,,,,,,,,,,,,,,,,,,,0,0,0,0,1,7,3,1,1,2,0,,,4,,4,,2,1,0,0,,,,,,,,,,,,,,,,,,,,,,,,,,,,,,,,,,,,,,,,,,,,,,,,,,,,,,,,,,,,,,,,,,,,,,,,,,,,,,,,,,,,,,,,,,0,0,0,0,0,,,0,0,,1,0,0,,1,0,0,0,0,0,,,,,,,,,,,,,,0,,0,,,,,,,,0,0,0,0,0,0,0,0,0,0,0,0,0,0,0,0,0,0,0,0,0,0,0,0,0,0,0,0,0,0,0,,,,,,,,,,,,,,,,,,,,,,,,,,,,,,,,,,,,,,,,,,,,,,,,,,,,,,,,,,,,,,,,,,,,,,,,,,,,,,,,,,,,,,,,,,,,,,,,,,,,,,,,,,,,,,,,,,,,,,,,,,,,,,,,,,,,,,,,,,,,,,,,,,,,,,,,,,,,,,,,,,,,,,,,,,,,2,3,2,1,3,1,1,1,3,0,0,0,0,,0,,,0,,,0,,,,,,1,0,0,,0,,1,1,0,,0,,1,1,0,,0,,1,1,1,1,0,,1,0,0,0,47.84161,58.67325,0,,1,0,0,0,8,0,0,0,1,0,0,0,0,0,0,0,0,0,0,1,0,1,0,730,200,2,5,4,4,2,2,1,,0,5,3,3,0,0,0,0,0,2,9,100000,730,1,0,0,82,83,0,0,0,730,0,0,0,1,0,0,0,0,1,0,0,0,0,0,0,0
80003753,1,1,3,0,2,3,1000,85066420,5117.1102795,1,0,3,0,0,1,0,0,0,0,0,0,0,1,1,1,0,0,1,1,0,0,,,,,,,,,,,,,,,,,,,,,,,0,0,1,1,1,6,2,1,3,2,1,6,2,2,4,2,4,0,1,0,0,,,,,,,,,,,,,,,,,,,,,,,,,,,,,,,,,,,,,,,,,,,,,,,,,,,,,,,,,,,,,,,,,,,,,,,,,,,,,,,,,,,,,,,,,,0,0,0,0,,0,0,0,0,,0,,0,,0,0,0,0,0,0,,,,,,,,,,,,,,0,,0,,,,,,,,0,0,0,0,0,0,0,0,0,0,0,0,0,0,0,0,0,0,0,0,0,0,0,0,0,0,0,0,0,0,0,,,,,,,,,,,,,,,,,,,,,,,,,,,,,,,,,,,,,,,,,,,,,,,,,,,,,,,,,,,,,,,,,,,,,,,,,,,,,,,,,,,,,,,,,,,,,,,,,,,,,,,,,,,,,,,,,,,,,,,,,,,,,,,,,,,,,,,,,,,,,,,,,,,,,,,,,,,,,,,,,,,,,,,,,,,,5,5,4,6,4,4,4,P,3,P,P,P,0,,1,1,0,0,,,1,0,1,P,P,0,0,,1,1,0,,1,1,1,1,0,,1,1,0,,0,,0,,0,,0,,1,1,1,1,22.18161,30.80325,0,P,P,P,P,P,P,P,P,P,P,P,P,P,P,P,P,0,0,0,0,0,0,0,,490,P,2,2,P,P,2,2,P,P,0,5,4,6,D,D,D,3,D,1,2,,490,3,0,0,27,28,380,380,1,110,0,0,0,0,0,1,0,0,0,0,0,0,0,0,0,0
80002449,2,3,2,0,1,1,1000,85079505,1236.5403428,1,1,1,,0,1,0,0,0,0,0,0,0,0,0,0,0,0,0,0,0,0,,,,,,,,,,,,,,,,,,,,,,,0,0,1,0,0,,,,,,,,,2,2,2,2,0,1,0,0,,,,,,,,,,,,,,,,,,,,,,,,,,,,,,,,,,,,,,,,,,,,,,,,,,,,,,,,,,,,,,,,,,,,,,,,,,,,,,,,,,,,,,,,,,0,0,0,0,,,,0,0,,0,,0,,0,0,0,0,0,0,,,,,,,,,,,,,,0,,0,,,,,,,,0,0,0,0,0,0,0,0,0,0,0,0,0,0,0,0,0,0,0,0,0,0,0,0,0,0,0,0,0,0,0,,,,,,,,,,,,,,,,,,,,,,,,,,,,,,,,,,,,,,,,,,,,,,,,,,,,,,,,,,,,,,,,,,,,,,,,,,,,,,,,,,,,,,,,,,,,,,,,,,,,,,,,,,,,,,,,,,,,,,,,,,,,,,,,,,,,,,,,,,,,,,,,,,,,,,,,,,,,,,,,,,,,,,,,,,,,5,2,2,4,4,5,2,5,3,1,0,0,0,,0,,,1,1,0,1,0,1,0,2,0,1,0,0,,0,,1,0,0,,0,,1,1,1,1,1,1,1,1,1,1,1,0,1,1,0,1,38.95161,30.84325,0,,1,0,2,0,0,0,0,1,0,0,0,0,0,0,0,0,0,0,0,0,0,1,0,730,0,2,1,2,1,2,2,1,,0,7,2,4,0,0,0,0,0,2,3,30000,730,1,0,0,12,13,0,0,0,730,0,0,0,0,0,0,0,0,1,0,1,0,0,0,0,0
80002563,1,1,3,0,1,2,1000,85073203,10180.329241,1,1,2,1,0,,,,,,,,,,,,,,,,,1,1,0,1,1,0,0,0,1,1,0,0,0,1,1,1,0,0,1,1,0,1,1,0,0,1,1,1,2,2,1,6,1,1,3,1,2,1,1,1,3,2,1,1,,,,,,,,,,,,,,,,,,,,,,,,,,,,,,,,,,,,,,,,,,,,,,,,,,,,,,,,,,,,,,,,,,,,,,,,,,,,,,,,,,,,,,,,,,,,,,,0,0,1,0,,0,,0,,0,0,0,1,1,0,,,0,0,0,0,0,0,7,0,0,0,,0,,1,1,0,0,0,0,0,0,0,0,0,0,0,0,0,0,1,0,0,0,0,1,0,1,1,0,0,0,0,0,0,0,0,1,0,0,0,0,1,,,,1,,1,,,,,,,,,,,,,10,,,,,,,,,,,,,,,,,,,,,,,,,,,,,,,,,,,,,,,,,,,,,,,,,,,,,,,,,,,,,,,,,,,,,,0,0,0,1,0,1,0,0,0,0,0,0,0,,,,,,,,,,,,,,,,,,,,,,,,,,,,,,,,,,,,,,,,,,,,,,,,,,,,,,,,,,,,5,2,0.75,,,,,,,,,5,4,4,5,3,4,4,4,4,1,0,0,0,,0,,,0,,,1,1,0,,,1,1,1,0,,0,,1,1,1,1,1,0,0,,0,,0,,0,,1,1,0,,1,1,1,0,27.89161,31.35325,0,,1,0,2,0,0,0,10,1,1,1,0,0,0,0,0,0,0,0,0,0,0,1,0,1400,0,2,4,2,2,1,2,1,,1,5,3,6,1,0,1,0,0,2,1,10000,1400,2,0,0,56,56,1700,1400,0,0,0,0,0,0,1,0,0,0,0,0,0,0,0,0,0,0
80003090,1,1,3,0,2,3,1000,85125915,1832.6091227,1,1,1,,0,1,1,0,0,0,0,0,1,1,0,0,0,0,0,1,0,0,,,,,,,,,,,,,,,,,,,,,,,0,0,0,0,0,,,,,,,,,3,,3,,1,2,0,1,,,,,,,,,,,,,,,,,,,,,,,,,,,,,,,,,,,,,,,,,,,,,,,,,,,,,,,,,,,,,,,,,,,,,,,,,,,,,,,,,,,,,,,,,,0,0,0,0,,0,0,0,0,,0,,0,,0,0,0,0,0,0,,,,,,,,,,,,,,0,,0,,,,,,,,0,0,0,0,0,0,0,0,0,0,0,0,0,0,0,0,0,0,0,0,0,0,0,0,0,0,0,0,0,0,0,,,,,,,,,,,,,,,,,,,,,,,,,,,,,,,,,,,,,,,,,,,,,,,,,,,,,,,,,,,,,,,,,,,,,,,,,,,,,,,,,,,,,,,,,,,,,,,,,,,,,,,,,,,,,,,,,,,,,,,,,,,,,,,,,,,,,,,,,,,,,,,,,,,,,,,,,,,,,,,,,,,,,,,,,,,,6,1,4,6,3,4,5,4,5,1,1,0,0,,0,,,0,,,0,,,,,,1,0,0,,1,1,0,,0,,0,,1,1,0,,1,0,1,1,1,1,0,,1,1,0,0,34.13161,19.25325,0,,1,1,2,0,0,0,0,1,1,0,0,0,0,0,0,0,0,0,0,1,0,1,0,670,190,2,3,2,2,2,2,1,,0,5,3,2,1,1,0,0,1,1,1,7900,670,3,0,0,149,149,620,560,0,110,1,0,0,0,1,0,0,0,0,0,0,0,0,0,0,0
80003493,1,1,3,0,1,1,1000,85114142,2817.8337409,1,1,4,0,0,1,0,0,0,0,0,0,0,0,0,0,0,0,0,0,0,0,,,,,,,,,,,,,,,,,,,,,,,0,1,0,0,0,,,,,,,,,4,,3,,0,2,1,1,,,,,,,,,,,,,,,,,,,,,,,,,,,,,,,,,,,,,,,,,,,,,,,,,,,,,,,,,,,,,,,,,,,,,,,,,,,,,,,,,,,,,,,,,,0,1,1,1,,,,1,1,0,0,,1,0,1,0,0,0,1,0,,,,,,,,,,,,,,0,,0,,,,,,,,0,0,0,0,0,0,0,0,0,1,0,0,0,1,0,0,1,0,0,0,0,0,0,0,0,0,0,0,0,0,0,,,,,,,,,,,,,,,,,,,,,,,,,,,,,,,,,,,,,,,,,,,,,,,,,,,,,,,,,,,,,,,,,,,,,,,,,,,,,,,,,,,,,,,,,,,,,,,,,,,,,,,,,,,,,,,,,,,,,,,,,,,,,,,,,,,,,,,,,,,,,,,,,,,,,,,,,,,,,,,,,,,,,,,,,,,,4,3,4,5,4,1,5,4,5,1,0,1,0,,0,,,0,,,1,1,1,1,0,1,1,1,0,,1,1,1,1,1,1,0,,1,0,1,0,0,,0,,0,,0,,1,1,1,1,34.38161,25.43325,0,,1,0,2,0,0,0,0,1,1,0,0,0,0,0,0,0,0,0,0,1,0,1,0,730,100,2,1,1,D,2,6,1,,0,7,4,1,0,0,0,0,0,1,2,,730,1,0,0,266,266,0,0,0,730,0,0,0,1,1,0,0,0,1,0,0,0,0,0,0,0
80000341,1,1,1,0,1,1,1000,85101537,1448.1098432,0,,2,1,0,0,0,0,0,0,1,0,1,0,0,0,0,0,0,0,0,0,,,,,,,,,,,,,,,,,,,,,,,0,0,1,0,1,2,2,0,,,,,,3,,2,3,,1,0,0,,,,,,,,,,,,,,,,,,,,,,,,,,,,,,,,,,,,,,,,,,,,,,,,,,,,,,,,,,,,,,,,,,,,,,,,,,,,,,,,,,,,,,,,,,0,0,0,0,0,,,0,0,,0,,0,,0,0,0,0,0,0,,,,,,,,,,,,,,0,,0,,,,,,,,0,0,0,0,0,0,0,0,0,0,0,0,0,0,0,0,0,0,0,0,0,0,0,0,0,0,0,0,0,0,0,,,,,,,,,,,,,,,,,,,,,,,,,,,,,,,,,,,,,,,,,,,,,,,,,,,,,,,,,,,,,,,,,,,,,,,,,,,,,,,,,,,,,,,,,,,,,,,,,,,,,,,,,,,,,,,,,,,,,,,,,,,,,,,,,,,,,,,,,,,,,,,,,,,,,,,,,,,,,,,,,,,,,,,,,,,,3,2,1,1,2,1,1,1,3,1,0,1,0,,0,,,0,,,0,,,,,,0,,0,,0,,0,,0,,0,,0,,0,,0,,0,,0,,0,,0,0,0,0,53.65161,58.34325,0,D,1,0,0,0,0,0,10,D,D,0,D,D,D,D,2,0,0,0,0,1,0,1,0,490,110,2,1,D,D,2,2,1,,0,5,2,2,0,0,0,0,0,2,3,,490,3,0,0,303,303,390,0,0,490,0,0,1,1,0,0,0,1,0,0,0,0,0,0,0,0