R4_Caseid_pub,R4_C_Rtype,R4_C_Resptype,R4_c_IntAge_Pub,R4_ORGSAMPINFO_SEX,R4_ORGSAMPINFO_BSTATUS,R4_a_strata,R4_a_psu_pub,R4_WTR4_BEN,R4_B1,R4_B3,R4_B23_2,R4_B23_3,R4_b24_i,R4_B25_A,R4_B25_B,R4_B25_C,R4_B25_D,R4_B25_F,R4_B25_G,R4_B25_H,R4_B25_I,R4_B25_J,R4_B25_L,R4_B25_M,R4_B25_N,R4_B25_O,R4_B25_P,R4_B25_Q,R4_B26,R4_B28,R4_B28A,R4_B29_A,R4_B29_B,R4_B29_C,R4_B29_D,R4_B29_E,R4_B29_F,R4_B29_G,R4_B29_H,R4_B29_1A,R4_B29_7_A,R4_B29_7_B,R4_B29_7_C,R4_B29_7_D,R4_B29_7_E,R4_B29_7_F,R4_B29_7_G,R4_B29_7_H,R4_B29_7_I,R4_B29_7_J,R4_B29_7_K,R4_B30,R4_B30_B,R4_B37,R4_B37A,R4_B38,R4_B39,R4_B40,R4_B41,R4_B42,R4_B43,R4_B44,R4_B45,R4_B46,R4_B47_A,R4_B47_B,R4_B47_C,R4_B47_D,R4_C_MAINCONCOLDIAGGRP_I_PUB,R4_c_adultchild_onset_i,R4_C_WrkdWhenLim,R4_C_EvrWorked,R4_C5A_1,R4_C7_1,R4_C10_1,R4_C18_1,R4_C20A_1,R4_C20B_1,R4_C20C_1,R4_C20D_1,R4_C20H_1,R4_C22,R4_C27,R4_C39_A,R4_C39_B,R4_C39_C,R4_C39_D,R4_C39_E,R4_C39_F,R4_C39_G,R4_C39_H,R4_C39_I,R4_C39_J,R4_C39_K,R4_C39_L,R4_C39A2,R4_C39B_A,R4_C39B_B,R4_C39B_C,R4_C39B_D,R4_C39B_E,R4_C39B_F,R4_C39b_g,R4_C39_1,R4_C39_3_A,R4_C39_3_B,R4_C39_3_C,R4_C39_3_D,R4_C39_3_E,R4_C39_3_F,R4_C39_3_G,R4_C39_3_H,R4_C39_4,R4_C39_4A,R4_C39_5,R4_C39_6,R4_C_MainCurJobSOC_PUB,R4_C_MainCurJobNAICS_PUB,R4_C_TotCurMnthPay_i_PUB,R4_C_MnthsMainCurJob_PUB,R4_C_MainCurJobRepSSA_PUB,R4_C_TotCurWkHrs_i_PUB,R4_C_TotCurHrMnth_i_PUB,R4_D1,R4_d6yr_m_PUB,R4_D8yr_m_PUB,R4_D15_m_PUB,R4_D16_m_PUB,R4_D17_m_PUB,R4_D18_m_PUB,R4_D25A,R4_D25_A,R4_D25_B,R4_D25_C,R4_D25_D,R4_D25_E,R4_D25_F,R4_D25_g,R4_D25_1,R4_D26_A,R4_D26_B,R4_D26_C,R4_D26_D,R4_D26_E,R4_D26_F,R4_D26_G,R4_D26_H,R4_D26_i,R4_D26_j,R4_D27,R4_D28,R4_D29,R4_D30,R4_C_MainJob2009SOC_PUB,R4_C_MainJob2009NAICS_PUB,R4_C_MainJobMnthPay2009_PUB,R4_C_MnthsMain2009Job,R4_C_TOT2009PAY_PUB,R4_C_TotHrs2009_PUB,R4_C_UsWkHr2009_PUB,R4_E3,R4_E5,R4_E7,R4_E9,R4_E12,R4_E15,R4_E16,R4_E17,R4_E19,R4_E20_A,R4_E20_B,R4_E20_C,R4_E20_D,R4_E20E_1,R4_E20_E,R4_E21,R4_E22,R4_E26,R4_E27_1,R4_E27_2,R4_E27_3,R4_E27_4,R4_E27_5,R4_E28_1,R4_E28_2,R4_E28_3,R4_E28_4,R4_E28_5,R4_E28_6,R4_E28_7,R4_E28_8,R4_E28_9,R4_E28_10,R4_E34,R4_E35,R4_C_AwareTTW,R4_F31_1,R4_F31_2,R4_F31_3,R4_F31_5,R4_F31_6,R4_F31_7,R4_F31_8,R4_F31_14,R4_F31_15,R4_F31_16,R4_F32,R4_F33_A,R4_F33_B,R4_F33_C,R4_F33_D,R4_F33_E,R4_F33_F,R4_G1,R4_G10,R4_G15,R4_G19,R4_G23,R4_G26,R4_G29,R4_G53_1,R4_G53_2,R4_G53_3,R4_G53_4,R4_G53_5,R4_G53_6,R4_G53_7,R4_G53_8,R4_G53_9,R4_G54,R4_G57,R4_G58,R4_G59,R4_G60,R4_G61_1,R4_G61_2,R4_G61_3,R4_G61_4,R4_G61_5,R4_G61_6,R4_G61_7
70004109,1,1,4,1,2,3000,85124294,16529.47355,1,0,1,,0,1,0,0,0,0,0,1,0,0,0,1,0,0,0,0,0,0,,,,,,,,,,,,,,,,,,,,,,0,0,1,1,0,,,,,,,,,3,,3,,0,2,1,1,,,,,,,,,,,,,,,,,,,,,,,,,,,,,,,,,,,,,,,,,,,,,,,,,,,,,,,,,,,,,,,,,,,,,,,,,,,,,,,,,,,,,,,,,,,,,,0,,0,0,0,,0,,0,0,0,0,,,,,,,,,,,,,,,,,,,0,,,,,,,,,,,,,,,,,,0,0,0,0,0,,,,,,,,,,,,,,0,,0,,,,,,,
70005058,1,1,2,1,2,2000,85098106,5072.169083,1,0,3,0,1,,,,,,,,,,,,,,,,,,,,,,,,,,,,,,,,,,,,,,,0,,0,1,0,,,,,,,,,2,1,2,2,0,2,1,1,1,0,1,2,0,0,0,0,0,0,0,3,4,1,4,4,2,3,2,2,3,3,2,0,,,,,,,,0,0,0,0,1,0,0,0,0,0,,0,,1,99,4,6,1,30,131,,,,,,,,,,,,,,,,,,,,,,,,,,,,,,,,,,,,,,,,,,,1,1,0,0,0,,0,,0,0,0,0,,,,,,,,,,,,,,,,,,,0,,,,,,,,,,,,,,,,,,0,0,0,0,0,,,,,,,,,,,,,,0,,0,,,,,,,
70000612,1,1,3,0,2,3000,85067389,4182.662548,1,1,2,1,0,1,0,0,0,1,0,0,0,1,0,0,0,0,0,0,0,0,,,,,,,,,,,,,,,,,,,,,,0,1,0,0,0,,,,,,,,,4,,3,,0,2,1,1,,,,,,,,,,,,,,,,,,,,,,,,,,,,,,,,,,,,,,,,,,,,,,,,,,,,,,,,,,,,,,,,,,,,,,,,,,,,,,,,,,,,,,,,,,,,,,1,1,1,0,1,0,1,0,0,0,1,,3,,,,,,,,,,,,,,,,0,0,1,,,,,,,,,,,,,,,,,,0,0,0,0,1,0,,,,,,,,,,,,,0,,0,,,,,,,
70002542,2,3,1,1,1,3000,85110430,1355.721555,1,1,1,,0,1,1,1,0,0,0,1,0,0,0,1,0,0,0,0,0,0,,,,,,,,,,,,,,,,,,,,,,0,0,0,1,0,,,,,,,,,4,,3,,1,1,0,0,,,,,,,,,,,,,,,,,,,,,,,,,,,,,,,,,,,,,,,,,,,,,,,,,,,,,,,,,,,,,,,,,,,,,,,,,,,,,,,,,,,,,,,,,0,0,0,0,0,,,,0,0,,1,0,1,0,D,1,,,,,,,,,,,,,,,,,,,D,,,,,,,,,,,,,,,,,,0,0,0,1,0,,,0,0,3,0,0,0,0,0,0,0,,1,1,0,,,,,,,
70005196,1,1,2,0,1,1000,85130116,2200.518708,1,1,5,0,0,1,0,0,1,0,0,0,0,0,0,0,0,0,0,0,0,0,,,,,,,,,,,,,,,,,,,,,,0,0,0,1,0,,,,,,,,,4,,R,,1,1,0,0,,,,,,,,,,,,,,,,,,,,,,,,,,,,,,,,,,,,,,,,,,,,,,,,,,,,,,,,,,,,,,,,,,,,,,,,,,,,,,,,,,,,,,,,,0,0,0,0,,,,,0,0,,0,,0,0,0,0,,,,,,,,,,,,,,,,,,,0,,,,,,,,,,,,,,,,,,0,0,0,0,1,0,,,,,,,,,,,,,0,,1,1,0,0,0,0,0,0
70003431,1,1,2,0,2,3000,85066372,2216.024131,1,1,1,,0,1,0,0,0,0,0,0,0,0,0,0,0,0,0,0,0,0,,,,,,,,,,,,,,,,,,,,,,0,0,0,0,0,,,,,,,,,3,,3,,0,2,0,1,,,,,,,,,,,,,,,,,,,,,,,,,,,,,,,,,,,,,,,,,,,,,,,,,,,,,,,,,,,,,,,,,,,,,,,,,,,,,,,,,,,,,,,,,,,,,,0,,0,0,0,,0,,0,0,0,0,,,,,,,,,,,,,,,,,,,0,,,,,,,,,,,,,,,,,,0,0,0,0,0,,,,,,,,,,,,,,0,,0,,,,,,,
70002769,1,2,2,0,1,3000,85110424,1751.653505,1,1,3,0,0,1,0,0,0,0,0,0,0,0,0,0,0,0,0,0,0,0,,,,,,,,,,,,,,,,,,,,,,0,0,0,0,1,3,2,0,,,,,,4,,4,,0,2,1,1,,,,,,,,,,,,,,,,,,,,,,,,,,,,,,,,,,,,,,,,,,,,,,,,,,,,,,,,,,,,,,,,,,,,,,,,,,,,,,,,,,,,,,,,,0,0,0,0,,,,,0,0,,0,,0,0,0,0,,,,,,,,,,,,,,,,,,,0,,,,,,,,,,,,,,,,,,0,0,0,1,1,0,,,,,,,,,,,,,1,4,1,0,0,0,0,0,0,7
70004497,1,1,3,1,1,2000,85126930,2770.388175,1,0,5,1,0,1,1,0,1,1,0,1,0,1,1,1,0,0,0,0,0,0,,,,,,,,,,,,,,,,,,,,,,0,1,1,1,0,,,,,,,,,4,,4,,0,2,1,1,,,,,,,,,,,,,,,,,,,,,,,,,,,,,,,,,,,,,,,,,,,,,,,,,,,,,,,,,,,,,,,,,,,,,,,,,,,,,,,,,,,,,,,,,0,0,0,0,,,,,0,0,,1,1,1,D,1,,3,,,,,,,,,,,,,,,,0,0,1,,,,,,,,,,,,,,,,,,0,0,0,0,1,0,,,,,,,,,,,,,0,,0,,,,,,,
70002689,2,3,3,0,1,3000,85110403,3396.127434,1,1,1,,0,1,1,0,0,0,0,0,0,1,1,D,0,0,0,0,0,0,,,,,,,,,,,,,,,,,,,,,,0,0,0,0,0,,,,,,,,,4,,4,,1,1,0,1,,,,,,,,,,,,,,,,,,,,,,,,,,,,,,,,,,,,,,,,,,,,,,,,,,,,,,,,,,,,,,,,,,,,,,,,,,,,,,,,,,,,,,,,,0,0,0,0,,,,,0,0,,0,,0,0,0,0,,,,,,,,,,,,,,,,,,,0,,,,,,,,,,,,,,,,,,0,1,1,0,0,0,,0,0,3,0,0,0,0,0,0,0,,0,,0,,,,,,,
70005171,1,1,2,0,1,3000,85124294,1676.559988,1,0,3,0,0,1,1,1,1,1,0,0,1,0,0,0,0,0,0,0,0,0,,,,,,,,,,,,,,,,,,,,,,0,0,0,0,0,,,,,,,,,4,,4,,0,1,0,0,,,,,,,,,,,,,,,,,,,,,,,,,,,,,,,,,,,,,,,,,,,,,,,,,,,,,,,,,,,,,,,,,,,,,,,,,,,,,,,,,,,,,,,,,0,0,0,0,,,,,0,0,,1,0,0,0,1,,3,,,,,,,,,,,,,,,,1,,1,1,2,0,0,0,0,0,0,0,0,0,2,2,2,2,2,2,0,0,0,0,0,,,,,,,,,,,,,,0,,0,,,,,,,
70005031,1,1,2,0,2,1000,85079518,1367.475512,1,1,4,0,0,1,0,0,1,0,0,0,0,0,1,0,0,0,0,0,0,0,,,,,,,,,,,,,,,,,,,,,,0,0,1,1,1,9,2,1,3,2,0,,,3,,2,3,0,2,1,1,,,,,,,,,,,,,,,,,,,,,,,,,,,,,,,,,,,,,,,,,,,,,,,,,,,,,,,,,,,,,,,,,,,,,,,,,,,,,,,,,,,,,,,,,,,,,,0,,0,0,0,,1,0,0,0,1,,3,,,,,,,,,,,,,,,,D,0,1,,,,,,,,,,,,,,,,,,0,0,1,0,0,,,0,0,3,0,0,0,0,0,0,0,,0,,0,,,,,,,
70003386,1,1,4,0,2,2000,85122229,16466.5278,1,1,3,1,0,1,0,0,0,0,0,0,0,0,0,0,0,0,0,0,0,0,,,,,,,,,,,,,,,,,,,,,,0,0,0,1,1,2,3,1,6,4,0,,,3,,3,,0,2,1,1,,,,,,,,,,,,,,,,,,,,,,,,,,,,,,,,,,,,,,,,,,,,,,,,,,,,,,,,,,,,,,,,,,,,,,,,,,,,,,,,,,,,,,,,,,,,,,1,0,1,1,1,0,1,0,1,1,1,,3,,,,,,,,,,,,,,,,1,,1,1,0,0,0,0,0,0,0,0,0,0,1,2,1,1,1,1,0,0,1,0,0,,,,,,,,,,,,,,0,,0,,,,,,,
70002662,1,2,3,1,3,3000,85073161,3387.954396,1,0,1,,1,,,,,,,,,,,,,,,,,,,,,,,,,,,,,,,,,,,,,,,1,,0,0,1,6,4,1,3,4,0,,,2,4,2,4,0,1,0,1,1,1,1,1,0,0,0,0,0,0,0,2,3,2,3,2,2,1,2,2,1,2,2,0,,,,,,,,0,0,0,0,0,0,0,0,0,0,,1,0,3,62,3,30,D,40,174,0,2000,,1,40,52,1,,,,,,,,,,,,,,,,,,,,,,,,3,62,3,12,8,2080,40,0,0,0,0,,0,,0,0,0,,0,,0,0,0,0,,,,,,,,,,,,,,,,,,,0,,,,,,,,,,,,,,,,,,0,0,0,0,0,,,,,,,,,,,,,,0,,0,,,,,,,
70000795,1,2,3,1,2,3000,85073161,3727.53342,1,1,1,,0,1,0,0,0,0,0,0,0,0,1,0,0,0,0,0,0,0,,,,,,,,,,,,,,,,,,,,,,0,0,0,1,1,1,3,0,,,,,,3,,2,D,2,2,1,1,,,,,,,,,,,,,,,,,,,,,,,,,,,,,,,,,,,,,,,,,,,,,,,,,,,,,,,,,,,,,,,,,,,,,,,,,,,,,,,,,,,,,,,,,,,,,,0,,0,0,0,,0,,0,0,0,0,,,,,,,,,,,,,,,,,,,0,,,,,,,,,,,,,,,,,,0,0,1,0,0,,,0,0,3,0,0,0,0,0,0,0,,1,4,0,,,,,,,
70000949,2,3,1,1,1,3000,85106924,1597.729837,1,1,1,,0,1,1,0,0,0,0,0,0,1,0,0,0,0,0,0,0,0,,,,,,,,,,,,,,,,,,,,,,0,0,0,1,0,,,,,,,,,4,,D,,2,1,0,0,,,,,,,,,,,,,,,,,,,,,,,,,,,,,,,,,,,,,,,,,,,,,,,,,,,,,,,,,,,,,,,,,,,,,,,,,,,,,,,,,,,,,,,,,0,0,0,0,0,,,,0,0,,0,,0,0,1,,2,1,0,0,0,0,1,0,0,0,0,0,0,0,0,0,1,,1,1,0,0,5,0,0,0,0,0,0,D,2,2,2,2,2,2,0,0,0,1,0,,,0,0,3,4,0,0,0,0,0,0,,1,3,1,0,0,0,0,0,6,0
70003895,1,1,2,0,1,2000,85131073,1775.69122,1,0,2,1,0,1,0,0,1,0,0,0,0,1,0,0,0,0,0,0,0,0,,,,,,,,,,,,,,,,,,,,,,0,1,1,0,1,2,2,0,,,,,,3,,2,3,1,1,0,0,,,,,,,,,,,,,,,,,,,,,,,,,,,,,,,,,,,,,,,,,,,,,,,,,,,,,,,,,,,,,,,,,,,,,,,,,,,,,,,,,,,,,,,,,0,0,0,0,,,,,1,1,0,0,,0,1,1,,3,,,,,,,,,,,,,,,,0,0,1,,,,,,,,,,,,,,,,,,0,0,0,1,0,,,,,,,,,,,,,,0,,0,,,,,,,
70004771,1,1,3,1,2,2000,85101539,3055.146773,1,0,1,,0,1,0,0,0,0,0,D,1,0,1,0,0,0,0,0,0,0,,,,,,,,,,,,,,,,,,,,,,0,0,1,1,0,,,,,,,,,4,,3,,0,2,1,1,,,,,,,,,,,,,,,,,,,,,,,,,,,,,,,,,,,,,,,,,,,,,,,,,,,,,,,,,,,,,,,,,,,,,,,,,,,,,,,,,,,,,,,,,,,,,,0,,0,0,0,,0,,0,0,0,0,,,,,,,,,,,,,,,,,,,0,,,,,,,,,,,,,,,,,,0,0,0,1,0,,,,,,,,,,,,,,0,,0,,,,,,,
70003061,1,1,2,0,2,1000,85108318,2605.925733,1,1,3,1,0,1,0,0,0,0,0,0,0,1,1,1,0,0,0,0,0,0,,,,,,,,,,,,,,,,,,,,,,0,0,1,1,1,1,1,1,3,1,1,8,1,3,,D,,0,2,1,1,,,,,,,,,,,,,,,,,,,,,,,,,,,,,,,,,,,,,,,,,,,,,,,,,,,,,,,,,,,,,,,,,,,,,,,,,,,,,,,,,,,,,,,,,,,,,,1,0,1,0,0,,0,,0,0,1,,1,0,0,0,0,5,0,0,0,0,5,0,0,0,0,0,0,0,1,,,,,,,,,,,,,,,,,,0,0,1,1,0,,,0,0,3,4,0,0,0,0,0,0,,1,2,0,,,,,,,
70003879,1,1,1,0,1,1000,85121188,2041.326868,1,1,5,1,0,1,0,0,0,0,0,0,0,1,0,0,0,0,0,0,0,0,,,,,,,,,,,,,,,,,,,,,,0,0,1,1,1,7,2,1,6,2,0,,,3,,3,,1,2,1,1,,,,,,,,,,,,,,,,,,,,,,,,,,,,,,,,,,,,,,,,,,,,,,,,,,,,,,,,,,,,,,,,,,,,,,,,,,,,,,,,,,,,,,,,,0,0,0,0,0,,,,0,0,,0,,0,0,1,,2,1,0,0,0,0,1,0,0,0,0,0,0,0,0,0,1,,1,0,0,0,0,0,0,8,0,0,0,1,2,2,2,2,2,2,0,0,0,1,0,,,0,0,3,0,0,0,0,0,0,0,,0,,0,,,,,,,
70003881,2,3,2,1,2,1000,85108318,3035.401377,1,1,1,,1,,,,,,,,,,,,,,,,,,,,,,,,,,,,,,,,,,,,,,,1,,0,0,0,,,,,,,,,2,4,D,,0,1,0,1,1,1,1,,0,0,0,0,0,0,0,,,,,,,,,,,,,0,,,,,,,,0,0,0,0,0,0,D,0,0,0,,0,,99,62,4,D,1,20,87,0,2000,,1,20,52,1,,,,,,,,,,,,,,,,,,,,,,,,99,62,4,D,D,1040,20,,,,,,0,,0,D,0,,0,,0,0,0,0,,,,,,,,,,,,,,,,,,,0,,,,,,,,,,,,,,,,,,0,1,1,0,0,0,,0,0,3,0,0,0,0,0,0,0,,0,,1,0,0,0,0,0,6,0
70001975,1,1,4,0,2,2000,85131073,18762.14795,1,1,5,0,0,1,0,0,0,0,0,0,0,0,0,0,0,0,0,0,0,0,,,,,,,,,,,,,,,,,,,,,,0,0,1,1,1,3,3,0,,,,,,3,,3,,3,2,0,1,,,,,,,,,,,,,,,,,,,,,,,,,,,,,,,,,,,,,,,,,,,,,,,,,,,,,,,,,,,,,,,,,,,,,,,,,,,,,,,,,,,,,,,,,,,,,,0,,0,0,0,,0,,0,0,1,,2,1,0,0,0,0,1,0,0,0,0,0,0,0,0,0,1,,1,1,0,0,0,0,0,0,0,0,0,0,1,1,2,2,2,2,0,0,0,1,0,,,0,0,3,0,0,0,0,0,0,0,,0,,0,,,,,,,
70003792,1,1,2,0,3,1000,85112508,1641.39329,1,1,4,1,0,1,0,0,0,0,0,0,0,0,0,0,0,0,0,0,0,0,,,,,,,,,,,,,,,,,,,,,,0,0,0,0,D,,,,,,,,,4,,3,,0,2,0,1,,,,,,,,,,,,,,,,,,,,,,,,,,,,,,,,,,,,,,,,,,,,,,,,,,,,,,,,,,,,,,,,,,,,,,,,,,,,,,,,,,,,,,,,,1,0,0,1,,1,0,1,1,1,0,1,0,0,0,1,,2,0,0,0,4,0,1,0,0,0,0,0,0,0,0,0,0,0,1,,,,,,,,,,,,,,,,,,0,0,0,1,0,,,,,,,,,,,,,,0,,0,,,,,,,
70004705,1,1,4,1,2,3000,85110421,16364.71675,1,D,1,,0,1,0,0,0,0,0,0,0,0,0,0,0,0,0,0,0,0,,,,,,,,,,,,,,,,,,,,,,0,0,0,0,0,,,,,,,,,4,,4,,3,2,1,1,,,,,,,,,,,,,,,,,,,,,,,,,,,,,,,,,,,,,,,,,,,,,,,,,,,,,,,,,,,,,,,,,,,,,,,,,,,,,,,,,,,,,,,,,,,,,,0,,0,0,0,,0,,0,0,0,0,,,,,,,,,,,,,,,,,,,0,,,,,,,,,,,,,,,,,,0,0,0,0,0,,,,,,,,,,,,,,0,,0,,,,,,,
70002400,2,3,3,1,2,2000,85120096,24459.41652,1,0,1,,0,1,0,0,0,0,0,0,0,0,1,0,0,0,0,0,0,0,,,,,,,,,,,,,,,,,,,,,,0,0,0,D,0,,,,,,,,,4,,4,,1,1,0,0,,,,,,,,,,,,,,,,,,,,,,,,,,,,,,,,,,,,,,,,,,,,,,,,,,,,,,,,,,,,,,,,,,,,,,,,,,,,,,,,,,,,,,,,,,,,,,0,,0,0,0,,0,,0,0,0,0,,,,,,,,,,,,,,,,,,,0,,,,,,,,,,,,,,,,,,0,0,0,0,0,,,,,,,,,,,,,,0,,0,,,,,,,
70003228,1,1,1,1,1,3000,85124294,2269.967778,0,,2,1,0,,,,,,,,,,,,,,,,,1,1,0,1,1,0,0,0,1,0,0,0,0,0,0,0,0,0,0,0,0,1,1,,1,1,1,1,1,0,,,,,,2,3,2,3,,1,0,1,,,,,,,,,,,,,,,,,,,,,,,,,,,,,,,,,,,,,,,,,,,,,,,,,,,,1,2009,2009,0,40,12,1,0,,,,,,,,,2,2,0,0,0,0,0,0,0,0,0,,0,,1,99,4,2,3,520,40,0,0,0,0,0,,,,0,0,,0,,0,0,0,0,,,,,,,,,,,,,,,,,,,0,,,,,,,,,,,,,,,,,,0,0,0,1,1,1,1,D,D,D,D,D,D,D,D,D,0,,0,,0,,,,,,,
70000442,2,3,2,1,2,2000,85105212,1502.028939,1,1,1,,0,1,D,0,0,D,0,1,0,0,0,D,0,0,0,0,0,0,,,,,,,,,,,,,,,,,,,,,,0,0,D,D,0,,,,,,,,,4,,4,,1,1,0,0,,,,,,,,,,,,,,,,,,,,,,,,,,,,,,,,,,,,,,,,,,,,,,,,,,,,,,,,,,,,,,,,,,,,,,,,,,,,,,,,,,,,,,,,,,,,,,0,,0,0,0,,1,0,0,0,1,,3,,,,,,,,,,,,,,,,0,0,1,,,,,,,,,,,,,,,,,,0,0,0,0,0,,,,,,,,,,,,,,0,,0,,,,,,,
70002866,1,1,2,1,3,3000,85110430,1851.148593,1,0,2,0,0,1,1,0,1,0,0,0,1,0,0,0,0,0,0,0,0,0,,,,,,,,,,,,,,,,,,,,,,0,0,1,1,1,2,2,0,,,,,,2,3,2,4,1,2,0,1,,,,,,,,,,,,,,,,,,,,,,,,,,,,,,,,,,,,,,,,,,,,,,,,,,,,,,,,,,,,,,,,,,,,,,,,,,,,,,,,,,,,,,,,,0,0,0,0,,0,,0,1,0,,0,,0,0,0,0,,,,,,,,,,,,,,,,,,,0,,,,,,,,,,,,,,,,,,0,1,1,1,0,0,,0,0,3,0,0,0,0,0,0,0,,0,,0,,,,,,,
70001077,2,3,3,0,2,3000,85067389,3548.17644,1,0,1,,1,,,,,,,,,,,,,,,,,,,,,,,,,,,,,,,,,,,,,,,1,,1,0,0,,,,,,,,,2,3,2,3,0,1,0,1,1,1,1,,0,0,0,0,1,0,1,,,,,,,,,,,,,1,0,0,0,0,0,0,0,0,0,0,0,0,0,0,0,0,0,,0,,1,62,3,30,1,20,87,0,2000,,1,20,50,1,,,,,,,,,,,,,,,,,,,,,,,,1,62,3,12,8,1000,20,,,,,,0,,0,0,0,,0,,0,0,0,0,,,,,,,,,,,,,,,,,,,0,,,,,,,,,,,,,,,,,,0,1,0,0,1,0,,,,,,,,,,,,,0,,0,,,,,,,
70003809,1,1,3,0,1,2000,85131073,3983.687228,1,1,4,0,0,1,1,1,0,0,0,1,0,1,1,1,0,0,0,0,0,0,,,,,,,,,,,,,,,,,,,,,,0,0,0,1,0,,,,,,,,,3,,2,2,1,2,0,1,,,,,,,,,,,,,,,,,,,,,,,,,,,,,,,,,,,,,,,,,,,,,,,,,,,,,,,,,,,,,,,,,,,,,,,,,,,,,,,,,,,,,,,,,0,0,0,0,,,,,0,0,,1,0,0,0,1,,3,,,,,,,,,,,,,,,,1,,1,0,0,0,0,0,0,8,0,0,0,1,2,2,2,2,2,2,0,0,0,0,0,,,,,,,,,,,,,,0,,0,,,,,,,
70005080,1,1,3,0,2,1000,85108318,3615.276694,1,1,3,0,0,1,0,0,0,0,0,0,0,0,0,0,0,0,0,0,0,0,,,,,,,,,,,,,,,,,,,,,,0,0,0,0,1,6,4,1,8,4,1,3,4,4,,4,,3,2,1,1,,,,,,,,,,,,,,,,,,,,,,,,,,,,,,,,,,,,,,,,,,,,,,,,,,,,,,,,,,,,,,,,,,,,,,,,,,,,,,,,,,,,,,,,,,,,,,0,,0,0,0,,0,,0,0,0,0,,,,,,,,,,,,,,,,,,,0,,,,,,,,,,,,,,,,,,0,0,1,0,0,,,,,,,,,,,,,,0,,0,,,,,,,
70004786,1,1,2,0,3,3000,85066399,2677.951778,1,0,2,1,1,,,,,,,,,,,,,,,,,,,,,,,,,,,,,,,,,,,,,,,1,,1,0,1,5,2,1,2,1,1,4,1,1,2,2,2,4,1,0,1,1,0,1,1,1,0,1,1,0,1,1,3,2,2,3,1,1,2,1,1,1,4,1,1,1,1,0,0,0,0,0,0,1,0,1,1,0,0,0,0,1,1,1,1,99,62,4,23,1,40,174,0,2008,,0,40,52,1,,,,,,,,,,,,,,,,,,,,,,,,99,62,4,12,8,2080,40,0,0,0,0,,0,,0,0,0,,0,,0,0,0,0,,,,,,,,,,,,,,,,,,,0,,,,,,,,,,,,,,,,,,0,0,0,0,0,,,,,,,,,,,,,,1,3,0,,,,,,,
70004471,1,1,4,0,2,2000,85098057,17160.60732,1,0,3,1,0,1,0,0,0,0,0,0,0,0,0,0,0,0,0,0,0,0,,,,,,,,,,,,,,,,,,,,,,0,0,0,0,0,,,,,,,,,3,,3,,3,2,1,1,,,,,,,,,,,,,,,,,,,,,,,,,,,,,,,,,,,,,,,,,,,,,,,,,,,,,,,,,,,,,,,,,,,,,,,,,,,,,,,,,,,,,,,,,,,,,,1,0,0,0,0,,1,0,1,0,1,,2,0,0,0,0,5,0,0,0,0,0,0,0,0,0,10,D,0,1,,,,,,,,,,,,,,,,,,0,0,0,0,0,,,,,,,,,,,,,,0,,0,,,,,,,
70003091,2,3,1,1,1,3000,85113572,2088.576126,1,0,1,,0,0,0,0,0,0,1,1,0,0,0,0,0,0,0,0,0,0,,,,,,,,,,,,,,,,,,,,,,0,0,1,0,1,6,2,0,,,,,,4,,4,,1,1,0,0,,,,,,,,,,,,,,,,,,,,,,,,,,,,,,,,,,,,,,,,,,,,,,,,,,,,,,,,,,,,,,,,,,,,,,,,,,,,,,,,,,,,,,,,,1,0,0,0,0,,,,0,0,,0,,0,0,0,1,,,,,,,,,,,,,,,,,,,0,,,,,,,,,,,,,,,,,,0,0,0,0,1,1,,,,,,,,,,,,,0,,0,,,,,,,
70000608,1,1,1,1,3,1000,85121191,1877.506548,0,,2,0,1,,,,,,,,,,,,,,,,,,,,,,,,,,,,,,,,,,,,,,,1,,1,1,1,6,1,0,,,,,,2,3,1,1,,2,1,1,0,0,1,3,0,0,0,0,0,1,0,2,3,3,3,2,2,4,3,2,2,1,2,1,1,0,0,1,0,0,0,1,1,0,1,0,0,1,0,0,0,,0,,3,99,4,27,,25,109,0,2008,,0,25,48,1,,,,,,,,,,,,,,,,,,,,,,,,3,99,4,12,8,1200,25,0,0,0,0,0,0,,0,0,0,,0,,0,0,1,,1,1,0,0,0,0,1,0,0,0,0,0,0,0,0,0,1,,1,0,0,0,0,6,0,0,0,0,0,1,2,2,2,2,2,2,0,0,0,0,0,,,,,,,,,,,,,,0,,0,,,,,,,
70001840,1,1,4,0,1,2000,85126930,12474.15419,0,,1,,0,1,0,0,0,0,0,0,0,0,1,0,0,0,1,1,0,0,,,,,,,,,,,,,,,,,,,,,,0,0,0,0,1,3,3,0,,,,,,3,,3,,,2,0,1,,,,,,,,,,,,,,,,,,,,,,,,,,,,,,,,,,,,,,,,,,,,,,,,,,,,,,,,,,,,,,,,,,,,,,,,,,,,,,,,,,,,,,,,,0,0,0,0,,,,,0,0,,0,,0,0,0,0,,,,,,,,,,,,,,,,,,,0,,,,,,,,,,,,,,,,,,0,0,0,0,0,,,,,,,,,,,,,,0,,0,,,,,,,
70005108,2,3,2,1,3,1000,85104614,1525.469215,1,0,5,0,0,1,0,0,0,0,0,0,0,0,0,0,0,0,0,0,0,0,,,,,,,,,,,,,,,,,,,,,,0,0,0,1,1,1,1,0,,,,,,3,,3,,1,1,0,1,,,,,,,,,,,,,,,,,,,,,,,,,,,,,,,,,,,,,,,,,,,,,,,,,,,,,,,,,,,,,,,,,,,,,,,,,,,,,,,,,,,,,,,,,0,0,0,0,,0,,0,0,0,,1,0,0,0,0,0,,,,,,,,,,,,,,,,,,,0,,,,,,,,,,,,,,,,,,0,0,0,0,0,,,,,,,,,,,,,,0,,0,,,,,,,
70002033,1,1,3,0,2,2000,85116995,3468.377664,1,1,1,,0,1,0,0,0,0,0,0,0,0,D,0,0,0,0,0,0,0,,,,,,,,,,,,,,,,,,,,,,0,0,D,1,0,,,,,,,,,3,,D,,0,2,1,1,,,,,,,,,,,,,,,,,,,,,,,,,,,,,,,,,,,,,,,,,,,,,,,,,,,,,,,,,,,,,,,,,,,,,,,,,,,,,,,,,,,,,,,,,,,,,,0,,0,0,0,,0,,0,0,1,,2,1,0,0,0,0,D,D,D,D,D,D,D,D,D,D,0,0,1,,,,,,,,,,,,,,,,,,0,0,0,0,0,,,,,,,,,,,,,,0,,0,,,,,,,
70001291,1,1,1,1,3,2000,85122229,1613.495489,1,D,1,,0,1,0,0,0,0,0,1,1,1,0,1,0,0,1,1,0,0,,,,,,,,,,,,,,,,,,,,,,0,0,1,0,1,1,2,0,,,,,,3,,2,2,2,1,D,0,,,,,,,,,,,,,,,,,,,,,,,,,,,,,,,,,,,,,,,,,,,,,,,,,,,,,,,,,,,,,,,,,,,,,,,,,,,,,,,,,,,,,,,,,0,0,0,0,0,0,,0,0,0,,0,,0,0,0,0,,,,,,,,,,,,,,,,,,,0,,,,,,,,,,,,,,,,,,0,0,0,1,0,,,,,,,,,,,,,,0,,0,,,,,,,
70003583,1,1,2,1,3,3000,85066372,1843.456428,1,1,2,0,0,1,1,0,0,0,0,0,0,0,0,0,0,0,0,0,0,0,,,,,,,,,,,,,,,,,,,,,,0,0,0,0,0,,,,,,,,,3,,2,3,2,2,0,1,,,,,,,,,,,,,,,,,,,,,,,,,,,,,,,,,,,,,,,,,,,,,,,,,,,,,,,,,,,,,,,,,,,,,,,,,,,,,,,,,,,,,,,,,0,0,0,0,,0,,0,0,0,,0,,0,0,0,0,,,,,,,,,,,,,,,,,,,0,,,,,,,,,,,,,,,,,,0,0,1,1,0,,,,,,,,,,,,,,D,,0,,,,,,,
70000150,1,1,2,1,2,3000,85110421,2087.1186,1,1,2,1,0,1,1,1,0,1,0,0,1,1,1,0,0,0,0,0,0,0,,,,,,,,,,,,,,,,,,,,,,0,0,1,1,1,2,3,0,,,,,,4,,2,3,0,2,0,1,,,,,,,,,,,,,,,,,,,,,,,,,,,,,,,,,,,,,,,,,,,,,,,,,,,,,,,,,,,,,,,,,,,,,,,,,,,,,,,,,,,,,,,,,,,,,,0,,0,0,0,,0,,0,0,1,,3,,,,,,,,,,,,,,,,0,0,1,,,,,,,,,,,,,,,,,,0,0,0,0,0,,,,,,,,,,,,,,0,,0,,,,,,,
70001904,2,3,2,1,1,3000,85119084,1979.301866,1,1,2,0,1,,,,,,,,,,,,,,,,,,,,,,,,,,,,,,,,,,,,,,,1,,1,0,0,,,,,,,,,1,4,1,4,0,1,0,1,1,1,0,,0,0,0,0,0,1,1,,,,,,,,,,,,,0,,,,,,,,0,0,0,0,0,0,0,0,0,0,,1,0,99,62,2,6,1,15,65,1,,,,,,,0,,,,,,,,,0,0,0,0,0,0,0,0,0,0,0,,0,,,,,,D,,,0,0,0,0,,,,,0,0,,0,,0,0,0,0,,,,,,,,,,,,,,,,,,,0,,,,,,,,,,,,,,,,,,0,0,1,0,0,,,0,0,3,4,0,0,0,0,0,0,,0,,0,,,,,,,
70005335,1,1,2,1,3,2000,85117053,2458.638013,1,1,5,0,0,1,0,0,0,0,0,0,0,1,0,0,0,0,0,0,0,0,,,,,,,,,,,,,,,,,,,,,,0,0,0,1,0,,,,,,,,,4,,R,,1,1,0,1,,,,,,,,,,,,,,,,,,,,,,,,,,,,,,,,,,,,,,,,,,,,,,,,,,,,,,,,,,,,,,,,,,,,,,,,,,,,,,,,,,,,,,,,,0,0,0,0,,0,,0,0,0,,0,,0,0,0,0,,,,,,,,,,,,,,,,,,,0,,,,,,,,,,,,,,,,,,0,0,0,0,0,,,,,,,,,,,,,,0,,1,0,2,0,0,0,0,0
70000683,1,1,3,0,2,1000,85104617,3938.628582,1,1,3,1,0,1,0,0,0,0,0,0,0,0,0,0,0,0,0,0,0,0,,,,,,,,,,,,,,,,,,,,,,0,0,0,1,1,8,3,0,,,,,,3,,2,2,1,2,1,1,,,,,,,,,,,,,,,,,,,,,,,,,,,,,,,,,,,,,,,,,,,,,,,,,,,,,,,,,,,,,,,,,,,,,,,,,,,,,,,,,,,,,,,,,,,,,,1,0,1,0,0,,1,0,1,0,1,,3,,,,,,,,,,,,,,,,0,0,1,,,,,,,,,,,,,,,,,,0,0,0,1,0,,,0,0,3,0,0,0,0,0,0,0,,0,,0,,,,,,,
70001288,1,1,2,0,1,3000,85107464,1882.031381,1,1,1,,0,1,0,1,1,0,0,0,0,0,0,0,0,0,0,0,0,0,,,,,,,,,,,,,,,,,,,,,,0,0,0,1,0,,,,,,,,,4,,4,,3,2,1,1,,,,,,,,,,,,,,,,,,,,,,,,,,,,,,,,,,,,,,,,,,,,,,,,,,,,,,,,,,,,,,,,,,,,,,,,,,,,,,,,,,,,,,,,,0,0,0,0,,,,,0,0,,0,,0,0,0,0,,,,,,,,,,,,,,,,,,,0,,,,,,,,,,,,,,,,,,0,0,1,0,0,,,,,,,,,,,,,,0,,0,,,,,,,
70000687,1,1,2,0,3,3000,85107464,1808.168654,1,0,5,1,0,1,0,0,1,0,0,1,0,1,0,0,0,0,0,0,0,0,,,,,,,,,,,,,,,,,,,,,,0,1,0,1,1,2,3,0,,,,,,3,,1,3,1,2,1,1,,,,,,,,,,,,,,,,,,,,,,,,,,,,,,,,,,,,,,,,,,,,,,,,,,,,,,,,,,,,,,,,,,,,,,,,,,,,,,,,,,,,,,,,,0,0,0,0,,1,1,0,0,0,,0,,0,0,0,0,,,,,,,,,,,,,,,,,,,0,,,,,,,,,,,,,,,,,,0,0,0,1,1,0,,0,0,3,4,0,0,0,0,0,0,,1,4,0,,,,,,,
70001969,1,1,1,1,1,2000,85120101,1805.241292,1,0,5,0,0,1,0,0,0,0,0,1,0,0,1,0,0,0,0,0,0,0,,,,,,,,,,,,,,,,,,,,,,0,1,1,1,0,,,,,,,,,2,2,2,2,1,1,0,0,,,,,,,,,,,,,,,,,,,,,,,,,,,,,,,,,,,,,,,,,,,,,,,,,,,,,,,,,,,,,,,,,,,,,,,,,,,,,,,,,,,,,,,,,0,0,0,0,0,,,,0,0,,0,,0,0,0,0,,,,,,,,,,,,,,,,,,,0,,,,,,,,,,,,,,,,,,0,0,0,0,0,,,,,,,,,,,,,,0,,0,,,,,,,
70004045,2,3,2,0,1,3000,85095941,1688.560883,1,1,1,,0,1,0,0,0,0,0,1,0,1,1,0,0,0,0,0,0,0,,,,,,,,,,,,,,,,,,,,,,0,0,1,0,0,,,,,,,,,4,,4,,0,1,0,0,,,,,,,,,,,,,,,,,,,,,,,,,,,,,,,,,,,,,,,,,,,,,,,,,,,,,,,,,,,,,,,,,,,,,,,,,,,,,,,,,,,,,,,,,0,0,0,0,,,,,0,0,,0,,0,0,0,0,,,,,,,,,,,,,,,,,,,0,,,,,,,,,,,,,,,,,,1,0,1,1,1,0,,1,0,3,4,0,0,0,0,0,0,,0,,0,,,,,,,
70004123,1,1,1,1,1,3000,85110401,1454.246504,1,0,2,1,0,,,,,,,,,,,,,,,,,1,1,0,1,1,0,0,1,1,0,0,0,0,0,0,0,0,0,0,0,0,0,0,0,1,1,1,1,1,1,6,1,0,,,1,4,1,3,1,1,0,0,,,,,,,,,,,,,,,,,,,,,,,,,,,,,,,,,,,,,,,,,,,,,,,,,,,,,,,,,,,,,,,,,,,,,,,,,,,,,,,,,,,,,,,,,0,0,0,0,0,,,,0,0,,0,,0,0,0,0,,,,,,,,,,,,,,,,,,,0,,,,,,,,,,,,,,,,,,0,0,1,0,1,0,,0,0,0,0,0,0,0,8,0,0,,0,,0,,,,,,,
70001395,1,2,2,1,1,1000,85104623,3509.044828,1,0,1,,0,0,0,0,0,0,0,0,0,0,0,0,0,0,0,0,0,0,,,,,,,,,,,,,,,,,,,,,,0,0,1,0,0,,,,,,,,,3,,3,,1,2,0,1,,,,,,,,,,,,,,,,,,,,,,,,,,,,,,,,,,,,,,,,,,,,,,,,,,,,,,,,,,,,,,,,,,,,,,,,,,,,,,,,,,,,,,,,,0,0,0,0,,,,,0,0,,0,,0,0,0,0,,,,,,,,,,,,,,,,,,,0,,,,,,,,,,,,,,,,,,0,0,0,0,0,,,,,,,,,,,,,,0,,0,,,,,,,
70003737,1,1,1,0,3,3000,85114935,2469.472616,1,0,4,0,0,1,1,1,0,0,0,1,1,0,0,0,0,0,0,0,0,0,,,,,,,,,,,,,,,,,,,,,,1,,1,0,1,1,2,0,,,,,,4,,1,1,0,2,1,1,,,,,,,,,,,,,,,,,,,,,,,,,,,,,,,,,,,,,,,,,,,,,,,,,,,,1,2009,2010,0,40,15,1,0,,,,,,,,,0,1,1,1,1,1,0,0,0,0,0,,1,1,2,44,4,2,3,600,40,1,0,0,0,0,0,,1,0,0,,1,0,0,0,0,1,,,,,,,,,,,,,,,,,,,0,,,,,,,,,,,,,,,,,,0,0,1,0,0,,,0,0,3,0,0,0,0,0,0,0,,0,,0,,,,,,,
70004103,1,1,3,0,2,2000,85120096,1623.604151,1,0,5,0,0,1,0,0,0,0,0,0,0,0,0,0,0,0,0,0,0,0,,,,,,,,,,,,,,,,,,,,,,0,0,0,0,1,6,3,0,,,,,,3,,3,,3,2,1,1,,,,,,,,,,,,,,,,,,,,,,,,,,,,,,,,,,,,,,,,,,,,,,,,,,,,,,,,,,,,,,,,,,,,,,,,,,,,,,,,,,,,,,,,,,,,,,0,,0,0,0,,0,,0,0,0,0,,,,,,,,,,,,,,,,,,,0,,,,,,,,,,,,,,,,,,0,0,1,0,0,,,,,,,,,,,,,,0,,0,,,,,,,
70003082,1,1,2,0,3,2000,85069472,1763.963381,1,0,1,,0,1,1,1,0,1,0,1,1,0,0,0,0,0,0,0,0,0,,,,,,,,,,,,,,,,,,,,,,0,0,1,1,0,,,,,,,,,3,,3,,2,1,0,0,,,,,,,,,,,,,,,,,,,,,,,,,,,,,,,,,,,,,,,,,,,,,,,,,,,,,,,,,,,,,,,,,,,,,,,,,,,,,,,,,,,,,,,,,0,0,0,0,,0,,0,0,0,,0,,0,0,0,0,,,,,,,,,,,,,,,,,,,0,,,,,,,,,,,,,,,,,,0,0,0,0,0,,,,,,,,,,,,,,0,,0,,,,,,,
70001020,2,3,2,1,3,2000,85122227,1552.635938,1,1,1,,0,1,0,0,0,0,0,1,0,0,0,0,0,0,0,0,0,0,,,,,,,,,,,,,,,,,,,,,,0,0,0,0,0,,,,,,,,,4,,4,,2,1,0,0,,,,,,,,,,,,,,,,,,,,,,,,,,,,,,,,,,,,,,,,,,,,,,,,,,,,,,,,,,,,,,,,,,,,,,,,,,,,,,,,,,,,,,,,,0,1,0,0,,1,0,0,0,0,,1,0,0,0,1,,3,,,,,,,,,,,,,,,,1,,1,1,0,0,0,0,0,0,0,0,0,0,1,1,2,2,2,2,0,0,0,0,0,,,,,,,,,,,,,,0,,0,,,,,,,
70003407,2,3,2,1,3,3000,85114935,2577.862733,0,,2,1,1,,,,,,,,,,,,,,,,,,,,,,,,,,,,,,,,,,,,,,,1,,1,0,1,1,2,1,6,1,0,,,1,3,2,3,,1,0,1,1,0,1,,0,0,0,0,0,0,1,,,,,,,,,,,,,0,,,,,,,,0,0,0,1,1,0,0,0,0,0,,0,,1,99,3,24,1,20,87,0,2008,,0,20,52,1,,,,,,,,,,,,,,,,,,,,,,,,1,99,3,12,8,1040,20,0,1,0,1,,0,,0,0,0,,0,,0,0,0,0,,,,,,,,,,,,,,,,,,,0,,,,,,,,,,,,,,,,,,1,0,1,0,1,0,,1,0,3,0,0,0,0,0,0,0,,1,2,0,,,,,,,
70004258,1,1,2,1,3,3000,85074277,2078.233601,1,1,1,,0,1,D,0,0,0,0,1,0,1,1,1,0,0,0,0,0,0,,,,,,,,,,,,,,,,,,,,,,0,0,D,1,0,,,,,,,,,4,,D,,2,1,0,1,,,,,,,,,,,,,,,,,,,,,,,,,,,,,,,,,,,,,,,,,,,,,,,,,,,,,,,,,,,,,,,,,,,,,,,,,,,,,,,,,,,,,,,,,0,0,0,0,,0,,0,0,1,0,0,,0,0,0,0,,,,,,,,,,,,,,,,,,,0,,,,,,,,,,,,,,,,,,0,0,0,0,0,,,,,,,,,,,,,,0,,D,,,,,,,
70000634,1,1,3,0,1,1000,85079477,20066.2748,0,,1,,0,1,0,0,0,0,0,0,0,0,0,0,0,0,0,0,0,0,,,,,,,,,,,,,,,,,,,,,,0,0,0,0,0,,,,,,,,,3,,3,,,2,1,1,,,,,,,,,,,,,,,,,,,,,,,,,,,,,,,,,,,,,,,,,,,,,,,,,,,,,,,,,,,,,,,,,,,,,,,,,,,,,,,,,,,,,,,,,0,1,0,1,,,,,0,0,,1,0,0,0,1,,3,,,,,,,,,,,,,,,,0,0,1,,,,,,,,,,,,,,,,,,0,0,0,0,0,,,,,,,,,,,,,,0,,0,,,,,,,
70005369,1,1,3,1,2,2000,85116995,2821.6672,1,1,5,0,0,1,1,0,0,0,0,0,0,0,0,0,0,0,0,0,0,0,,,,,,,,,,,,,,,,,,,,,,0,0,0,1,1,2,4,0,,,,,,3,,3,,3,2,1,1,,,,,,,,,,,,,,,,,,,,,,,,,,,,,,,,,,,,,,,,,,,,,,,,,,,,,,,,,,,,,,,,,,,,,,,,,,,,,,,,,,,,,,,,,,,,,,1,0,1,0,1,0,1,0,0,0,0,1,,,,,,,,,,,,,,,,,,,0,,,,,,,,,,,,,,,,,,0,0,1,0,0,,,,,,,,,,,,,,0,,0,,,,,,,
70003476,1,1,3,1,2,3000,85113572,3197.181261,1,0,1,,0,1,0,0,0,0,0,0,0,0,0,0,0,0,0,0,0,0,,,,,,,,,,,,,,,,,,,,,,0,0,0,0,0,,,,,,,,,4,,4,,0,2,1,1,,,,,,,,,,,,,,,,,,,,,,,,,,,,,,,,,,,,,,,,,,,,,,,,,,,,,,,,,,,,,,,,,,,,,,,,,,,,,,,,,,,,,,,,,,,,,,1,1,1,1,1,0,0,,0,0,0,0,,,,,,,,,,,,,,,,,,,0,,,,,,,,,,,,,,,,,,0,0,1,0,0,,,,,,,,,,,,,,0,,0,,,,,,,
70003880,2,3,3,0,1,2000,85117988,2895.839114,1,1,1,,0,1,1,1,1,1,0,0,0,0,0,0,0,0,0,0,0,0,,,,,,,,,,,,,,,,,,,,,,0,0,0,0,1,6,2,0,,,,,,3,,2,4,0,2,0,0,,,,,,,,,,,,,,,,,,,,,,,,,,,,,,,,,,,,,,,,,,,,,,,,,,,,,,,,,,,,,,,,,,,,,,,,,,,,,,,,,,,,,,,,,0,0,0,0,,,,,0,0,,0,,0,0,0,1,,,,,,,,,,,,,,,,,,,0,,,,,,,,,,,,,,,,,,0,0,1,0,0,,,0,0,3,0,0,0,0,0,0,0,,1,3,0,,,,,,,
70003554,1,1,2,1,2,2000,85122234,5670.76035,1,0,2,1,0,0,1,0,0,0,0,0,0,0,0,0,0,0,0,0,1,0,,,,,,,,,,,,,,,,,,,,,,0,1,1,0,1,6,2,0,,,,,,2,4,1,3,1,2,0,0,,,,,,,,,,,,,,,,,,,,,,,,,,,,,,,,,,,,,,,,,,,,,,,,,,,,,,,,,,,,,,,,,,,,,,,,,,,,,,,,,,,,,,,,,,,,,,0,,0,0,0,,0,,0,0,0,1,,,,,,,,,,,,,,,,,,,D,,,,,,,,,,,,,,,,,,1,0,1,0,0,,,0,0,3,4,0,0,0,0,0,0,,0,,0,,,,,,,
70002876,1,1,3,0,1,1000,85079509,1582.073046,0,,2,0,1,,,,,,,,,,,,,,,,,,,,,,,,,,,,,,,,,,,,,,,1,,1,R,1,3,1,0,,,,,,1,R,1,R,,2,0,1,0,D,1,4,1,0,0,1,0,0,0,4,4,4,2,2,2,1,1,2,2,2,2,0,,,,,,,,0,0,0,0,1,0,1,0,0,0,,1,1,99,56,4,7,,40,174,1,2008,2010,0,40,52,1,0,,,,,,,,,2,2,2,1,2,1,2,0,0,0,0,,1,1,99,56,4,12,8,2080,40,0,0,0,1,,,,,0,0,,0,,0,0,0,0,,,,,,,,,,,,,,,,,,,0,,,,,,,,,,,,,,,,,,0,0,0,0,0,,,,,,,,,,,,,,0,,0,,,,,,,